program: Orca
programVersion: 5.0.2
elementType: N H C H C O C C O N H C H H H O H H S H C O C H H C H H C H N H H C O O H H
charge: 1
multiplicity: 1
keywords: wB97X-D3BJ Opt Freq def2-TZVPP def2/J RIJCOSX VeryTightSCF
keywords: PAL8 defgrid3 TightOpt
frequency: 0.00 0.00 0.00 0.00 0.00 0.00 28.52 32.89 49.01 62.84 74.00 86.40 91.12 109.37 123.67 140.28 163.70 168.55 182.35 221.38 242.51 263.75 275.37 307.29 316.53 325.42 338.30 355.52 376.71 384.02 445.18 474.36 497.25 516.51 528.45 548.74 558.75 579.04 598.63 609.16 622.88 645.69 656.09 690.51 711.98 737.92 743.59 810.02 841.48 867.35 886.82 901.39 911.59 931.97 973.80 1013.88 1017.99 1021.44 1050.09 1067.55 1126.56 1133.44 1155.06 1158.00 1166.20 1206.73 1219.19 1239.24 1240.93 1278.20 1295.54 1312.08 1325.05 1328.80 1335.43 1353.45 1372.66 1374.35 1388.54 1412.51 1431.58 1452.47 1464.07 1475.78 1476.67 1490.54 1493.91 1562.12 1585.60 1592.11 1633.75 1678.01 1743.10 1764.29 1822.72 1858.08 2747.47 2774.45 3085.27 3091.73 3091.86 3104.65 3107.84 3115.51 3128.47 3148.84 3153.48 3171.55 3293.75 3573.79 3597.25 3668.23 3787.03 3800.65
frequency: 28.52 32.89 49.01 62.84 74.00 86.40 91.12 109.37 123.67 140.28 163.70 168.55 182.35 221.38 242.51 263.75 275.37 307.29 316.53 325.42 338.30 355.52 376.71 384.02 445.18 474.36 497.25 516.51 528.45 548.74 558.75 579.04 598.63 609.16 622.88 645.69 656.09 690.51 711.98 737.92 743.59 810.02 841.48 867.35 886.82 901.39 911.59 931.97 973.80 1013.88 1017.99 1021.44 1050.09 1067.55 1126.56 1133.44 1155.06 1158.00 1166.20 1206.73 1219.19 1239.24 1240.93 1278.20 1295.54 1312.08 1325.05 1328.80 1335.43 1353.45 1372.66 1374.35 1388.54 1412.51 1431.58 1452.47 1464.07 1475.78 1476.67 1490.54 1493.91 1562.12 1585.60 1592.11 1633.75 1678.01 1743.10 1764.29 1822.72 1858.08 2747.47 2774.45 3085.27 3091.73 3091.86 3104.65 3107.84 3115.51 3128.47 3148.84 3153.48 3171.55 3293.75 3573.79 3597.25 3668.23 3787.03 3800.65
formula: C10H18N3O6S
InChI: InChI=1S/C10H18N3O6S/c11-5(10(18)19)1-2-7(14)13-6(4-20)9(17)12-3-8(15)16/h5-6,12-13,15,18,20H,1-4H2,11H3
38 atoms
N  0.115437 3.644365 -0.774152
H  0.319164 3.958885 0.163421
C  0.605234 4.399676 -1.906273
H  -0.156615 4.457321 -2.68206
C  1.861884 3.785319 -2.505198
O  2.763134 3.312927 -1.848749
C  -0.158258 2.338197 -0.967666
C  -0.758386 1.525196 0.199675
O  -0.019489 1.796219 -2.052075
N  -0.17719 0.182509 0.149216
H  -1.80079 1.391941 -0.10263
C  -0.83245 2.160705 1.587385
H  -0.767886 -0.538788 -0.228905
H  -1.513085 3.009851 1.521472
H  -1.275248 1.428603 2.261538
O  1.87687 3.866897 -3.828807
H  2.67561 3.431222 -4.156627
H  0.846634 5.412117 -1.58029
S  0.745661 2.745015 2.284177
H  0.168994 3.443309 3.270417
C  1.145123 0.046549 -0.056317
O  1.915974 0.955762 0.255118
C  1.607834 -1.225221 -0.731229
H  1.243474 -2.080139 -0.155525
H  1.103768 -1.273853 -1.700112
C  3.12264 -1.362861 -0.904927
H  3.319898 -2.364759 -1.286286
H  3.618591 -1.297981 0.066693
C  3.828192 -0.384083 -1.859174
H  4.81808 -0.791306 -2.078858
N  4.015574 0.966128 -1.25588
H  3.272417 1.086453 -0.508374
H  4.940341 1.088021 -0.855552
C  3.166307 -0.185623 -3.221016
O  3.102224 0.879543 -3.772118
O  2.73367 -1.337118 -3.728146
H  2.373625 -1.170645 -4.611333
H  3.82992 1.723015 -1.934106
totalener: -1406.25262619 hartree
nucrepener: 2012.31587795 hartree
electener: -3418.56850414 hartree
oneelecener: -5909.30185607 hartree
twoeener: 2490.73335192 hartree
kineticenergy: 1401.51000977 hartree
exchangeener: -105.480124602439 hartree
correlationener: -7.070308007838 hartree
xcener: -112.550432610277 hartree
temp: 298.15 k
press: 1.00 atm
thermalcorrenthalpy: 0.00094421 hartree
totalenthalpy: -1406.00614047 hartree
totalentropycorr: -0.06710637 hartree
gibbsenthalpy: -1406.07324684 hartree
gibbsminuselec: 0.26500318 hartree
chargesum: 1.0000000
charge: -0.171586 0.179180 -0.067367 0.135325 0.378331 -0.416911 0.232124 0.026555 -0.388027 -0.175369 0.123667 -0.185663 0.184414 0.140648 0.125761 -0.239850 0.239272 0.128962 -0.146847 0.119534 0.310379 -0.410758 -0.193641 0.154358 0.129371 -0.202506 0.137064 0.133199 -0.015175 0.138264 -0.051443 0.222312 0.214562 0.310428 -0.312953 -0.253769 0.251450 0.216704
charge: 0.332211 -0.048849 -0.031901 0.039393 -0.424095 0.094782 -0.385303 -0.121885 0.085333 0.347927 0.050707 -0.229924 -0.010217 0.010451 0.009051 0.399775 -0.082806 0.039483 0.484024 -0.146239 -0.343442 0.170368 -0.005219 0.044774 0.038933 0.003384 0.043459 0.036780 -0.053651 0.048479 0.602167 -0.064700 0.032516 -0.429875 0.135634 0.397161 -0.066723 -0.001962
qa: -0.1716 0.1792 -0.0674 0.1353 0.3783 -0.4169 0.2321 0.0266 -0.3880 -0.1754 0.1237 -0.1857 0.1844 0.1406 0.1258 -0.2398 0.2393 0.1290 -0.1468 0.1195 0.3104 -0.4108 -0.1936 0.1544 0.1294 -0.2025 0.1371 0.1332 -0.0152 0.1383 -0.0514 0.2223 0.2146 0.3104 -0.3130 -0.2538 0.2514 0.2167
va: 3.1690 1.0631 3.8800 1.0169 4.1777 2.0984 4.2320 3.9045 2.1413 3.2407 1.0001 3.9746 1.0108 0.9980 1.0077 2.2732 1.0240 1.0000 2.1832 1.0148 4.1245 2.0728 3.7669 0.9964 1.0280 3.9130 1.0084 1.0062 3.9066 1.0035 3.5418 1.0961 0.9844 4.3152 2.1761 2.2596 1.0082 1.0595
dispcorr: -0.083490459 hartree
energy: -1406.341523966026
dipole: -0.20040 1.16259 0.96219 -5.66095 3.98178 -1.67916 4.26769 -4.20567 0.06202
magnitude: 1.93630 au
magnitude: 4.92168 debye
zeropoint: 0.31112520 hartree
thermalvibcorrection: 0.01791305 hartree
thermalrotcorrection: 0.00141627 hartree
thermaltrasncorrection: 0.00141627 hartree
thermaltotal: -1406.00965318 hartree
thermalcorr: 0.02074559 hartree
nonthermalcorr: 0.31112520 hartree
totalcorr: 0.33187079 hartree
totalenthalpy: -1406.00870897 hartree
