program: Orca
programVersion: 5.0.2
elementType: N H C H C O C C O N H C H H H O H H S H C O C H H C H H C H N H H C O O H H
charge: 1
multiplicity: 1
keywords: wB97X-D3BJ Opt Freq def2-TZVPP def2/J RIJCOSX VeryTightSCF
keywords: PAL8 defgrid3 TightOpt
frequency: 0.00 0.00 0.00 0.00 0.00 0.00 45.66 46.41 55.19 74.35 83.69 88.52 103.87 122.63 127.73 133.89 144.48 160.42 172.13 198.02 216.80 223.98 246.15 280.58 318.42 325.95 328.31 337.99 377.32 395.31 413.35 469.10 502.92 532.47 553.82 558.78 574.49 588.68 606.08 651.98 655.84 697.56 745.46 750.84 760.01 778.82 818.09 837.73 851.37 885.95 898.20 908.46 930.45 951.47 977.88 986.45 1037.67 1051.57 1060.16 1066.57 1092.26 1134.70 1152.05 1165.06 1184.15 1222.98 1227.79 1241.10 1266.63 1269.63 1306.23 1320.49 1333.38 1342.51 1355.77 1361.20 1380.51 1391.65 1408.34 1416.29 1431.56 1461.49 1482.88 1492.20 1493.64 1502.92 1508.59 1518.96 1572.46 1585.65 1615.43 1706.25 1709.25 1775.40 1794.66 1824.51 2768.24 2857.01 2885.84 3090.24 3098.88 3108.63 3116.46 3119.51 3144.93 3150.41 3161.54 3163.43 3183.26 3455.00 3568.88 3647.42 3678.01 3792.00
frequency: 45.66 46.41 55.19 74.35 83.69 88.52 103.87 122.63 127.73 133.89 144.48 160.42 172.13 198.02 216.80 223.98 246.15 280.58 318.42 325.95 328.31 337.99 377.32 395.31 413.35 469.10 502.92 532.47 553.82 558.78 574.49 588.68 606.08 651.98 655.84 697.56 745.46 750.84 760.01 778.82 818.09 837.73 851.37 885.95 898.20 908.46 930.45 951.47 977.88 986.45 1037.67 1051.57 1060.16 1066.57 1092.26 1134.70 1152.05 1165.06 1184.15 1222.98 1227.79 1241.10 1266.63 1269.63 1306.23 1320.49 1333.38 1342.51 1355.77 1361.20 1380.51 1391.65 1408.34 1416.29 1431.56 1461.49 1482.88 1492.20 1493.64 1502.92 1508.59 1518.96 1572.46 1585.65 1615.43 1706.25 1709.25 1775.40 1794.66 1824.51 2768.24 2857.01 2885.84 3090.24 3098.88 3108.63 3116.46 3119.51 3144.93 3150.41 3161.54 3163.43 3183.26 3455.00 3568.88 3647.42 3678.01 3792.00
formula: C10H18N3O6S
InChI: InChI=1S/C10H18N3O6S/c11-5(10(18)19)1-2-7(14)13-6(4-20)9(17)12-3-8(15)16/h5-6,12-13,15,18,20H,1-4H2,11H3
38 atoms
N  0.153306 2.572816 -1.657865
H  1.035609 2.4189 -1.198363
C  0.059503 3.442369 -2.802085
H  -0.631443 4.265685 -2.619873
C  -0.400492 2.712369 -4.049119
O  -0.156335 1.550988 -4.316977
C  -0.979806 2.008432 -1.172433
C  -0.860037 1.181003 0.118417
O  -2.058887 2.163628 -1.706843
N  0.015827 0.008544 -0.015312
H  -1.85827 0.775437 0.27255
C  -0.5068 2.057613 1.321331
H  -0.442252 -0.886333 -0.040672
H  0.419804 2.601627 1.158742
H  -1.321473 2.768195 1.455663
O  -1.070329 3.500602 -4.86891
H  -1.311364 2.999211 -5.660817
H  1.047463 3.851738 -3.018198
S  -0.362601 0.995257 2.785248
H  -0.392347 1.977358 3.691266
C  1.345642 0.012164 -0.002705
O  2.01618 1.060577 0.007237
C  2.064576 -1.319666 -0.002277
H  2.74934 -1.27498 0.848276
H  1.380447 -2.144555 0.19555
C  2.838707 -1.629477 -1.301565
H  2.16556 -2.075753 -2.032213
H  3.592608 -2.385527 -1.072428
C  3.509141 -0.462123 -2.023266
H  4.1916 -0.858065 -2.778776
N  4.306177 0.414916 -1.106313
H  3.608067 0.777784 -0.400563
H  5.086865 -0.065576 -0.667231
C  2.568882 0.511281 -2.75304
O  2.910709 1.661474 -2.922268
O  1.457392 -0.047448 -3.134723
H  0.839947 0.618836 -3.587798
H  4.632628 1.222495 -1.643272
totalener: -1406.25171998 hartree
nucrepener: 1957.73573318 hartree
electener: -3363.98745316 hartree
oneelecener: -5799.67217490 hartree
twoeener: 2435.68472173 hartree
kineticenergy: 1400.66519914 hartree
exchangeener: -105.336451882325 hartree
correlationener: -7.062009003495 hartree
xcener: -112.398460885820 hartree
temp: 298.15 k
press: 1.00 atm
thermalcorrenthalpy: 0.00094421 hartree
totalenthalpy: -1406.00757689 hartree
totalentropycorr: -0.06417941 hartree
gibbsenthalpy: -1406.07175630 hartree
gibbsminuselec: 0.26434938 hartree
chargesum: 1.0000000
charge: -0.243725 0.202243 -0.095677 0.153577 0.363542 -0.341667 0.188663 0.060096 -0.328939 -0.166783 0.151686 -0.184696 0.200427 0.123272 0.149270 -0.227355 0.246103 0.140114 -0.161551 0.121239 0.354868 -0.479049 -0.239439 0.141092 0.111126 -0.184143 0.132449 0.136595 -0.011034 0.162463 -0.070305 0.231090 0.220691 0.304305 -0.363582 -0.296603 0.265671 0.233965
charge: 0.330279 -0.050870 -0.042032 0.041852 -0.391679 0.189488 -0.383559 -0.119888 0.114878 0.364776 0.048679 -0.227963 -0.002976 -0.005117 0.016813 0.413441 -0.068753 0.042013 0.471011 -0.142243 -0.362452 0.115078 0.002774 0.040388 0.037248 0.001604 0.043110 0.033701 -0.050735 0.047721 0.604963 -0.027513 0.037355 -0.478862 0.098718 0.384657 -0.168347 0.042443
qa: -0.2437 0.2022 -0.0957 0.1536 0.3635 -0.3417 0.1887 0.0601 -0.3289 -0.1668 0.1517 -0.1847 0.2004 0.1233 0.1493 -0.2274 0.2461 0.1401 -0.1616 0.1212 0.3549 -0.4790 -0.2394 0.1411 0.1111 -0.1841 0.1324 0.1366 -0.0110 0.1625 -0.0703 0.2311 0.2207 0.3043 -0.3636 -0.2966 0.2657 0.2340
va: 3.1035 1.0239 3.8558 1.0136 4.1960 2.1474 4.3263 3.7268 2.2014 3.2534 1.0202 3.9987 0.9990 1.0115 1.0024 2.2994 1.0129 1.0074 2.1694 1.0197 4.0065 2.0197 3.8871 1.0114 1.0220 3.8232 1.0226 1.0006 3.8587 0.9928 3.6031 1.0699 0.9802 4.3425 2.1338 2.2152 1.0956 0.9977
dispcorr: -0.084374116 hartree
energy: -1406.342027026285
dipole: 10.05942 -6.28088 3.77854 -5.38622 3.81992 -1.56630 5.07336 -4.73665 0.33671
magnitude: 4.10415 au
magnitude: 10.43192 debye
zeropoint: 0.31153535 hartree
thermalvibcorrection: 0.01779479 hartree
thermalrotcorrection: 0.00141627 hartree
thermaltrasncorrection: 0.00141627 hartree
thermaltotal: -1406.00986434 hartree
thermalcorr: 0.02062734 hartree
nonthermalcorr: 0.31153535 hartree
totalcorr: 0.33216269 hartree
totalenthalpy: -1406.00892013 hartree
