program: Orca
programVersion: 5.0.2
elementType: N H C H C O C C O N H C H H H O H H S H C O C H H C H H C H N H H C O O H H
charge: 1
multiplicity: 1
keywords: wB97X-D3BJ Opt Freq def2-TZVPP def2/J RIJCOSX VeryTightSCF
keywords: PAL8 defgrid3 TightOpt
frequency: 0.00 0.00 0.00 0.00 0.00 0.00 15.15 23.94 36.37 38.43 51.76 58.42 70.68 77.28 90.61 119.83 137.54 147.08 177.00 185.53 191.12 216.28 261.29 267.36 279.73 320.50 336.20 350.08 369.70 425.42 434.08 455.90 485.18 497.31 524.78 550.84 576.94 577.49 621.79 633.43 633.94 665.52 671.91 678.33 727.10 733.26 763.89 802.83 821.84 867.49 894.43 921.13 935.83 960.66 970.67 997.87 1015.46 1028.62 1051.02 1070.11 1101.87 1135.50 1148.76 1154.83 1166.38 1202.94 1206.65 1229.05 1250.77 1255.84 1270.13 1279.72 1283.68 1326.92 1328.99 1343.18 1358.74 1368.09 1378.23 1408.67 1436.61 1447.30 1462.24 1495.86 1498.70 1500.18 1506.06 1516.22 1588.12 1605.74 1644.87 1696.88 1717.72 1765.24 1850.91 1893.81 2635.72 2768.21 3080.87 3090.82 3095.18 3101.47 3110.63 3120.19 3130.67 3146.52 3161.65 3169.04 3500.09 3561.04 3609.64 3623.46 3791.82 3801.05
frequency: 15.15 23.94 36.37 38.43 51.76 58.42 70.68 77.28 90.61 119.83 137.54 147.08 177.00 185.53 191.12 216.28 261.29 267.36 279.73 320.50 336.20 350.08 369.70 425.42 434.08 455.90 485.18 497.31 524.78 550.84 576.94 577.49 621.79 633.43 633.94 665.52 671.91 678.33 727.10 733.26 763.89 802.83 821.84 867.49 894.43 921.13 935.83 960.66 970.67 997.87 1015.46 1028.62 1051.02 1070.11 1101.87 1135.50 1148.76 1154.83 1166.38 1202.94 1206.65 1229.05 1250.77 1255.84 1270.13 1279.72 1283.68 1326.92 1328.99 1343.18 1358.74 1368.09 1378.23 1408.67 1436.61 1447.30 1462.24 1495.86 1498.70 1500.18 1506.06 1516.22 1588.12 1605.74 1644.87 1696.88 1717.72 1765.24 1850.91 1893.81 2635.72 2768.21 3080.87 3090.82 3095.18 3101.47 3110.63 3120.19 3130.67 3146.52 3161.65 3169.04 3500.09 3561.04 3609.64 3623.46 3791.82 3801.05
formula: C10H18N3O6S
InChI: InChI=1S/C10H18N3O6S/c11-5(10(18)19)1-2-7(14)13-6(4-20)9(17)12-3-8(15)16/h5-6,12-13,15,18,20H,1-4H2,11H3
38 atoms
N  -1.306198 2.35245 2.427535
H  -1.93486 2.905579 1.863904
C  -1.289226 2.675525 3.834903
H  -1.525306 1.799925 4.443528
C  -2.323644 3.752408 4.079034
O  -3.015555 4.223564 3.214364
C  -0.61961 1.320476 1.922171
C  -0.848379 1.068698 0.413931
O  0.126911 0.618755 2.589698
N  0.023192 0.003789 -0.033977
H  -0.588927 1.983397 -0.122587
C  -2.301231 0.70363 0.104529
H  -0.372658 -0.925381 -0.023573
H  -2.961066 1.518676 0.396222
H  -2.405119 0.542939 -0.967399
O  -2.365427 4.110117 5.362958
H  -3.040804 4.794749 5.464818
H  -0.310966 3.040125 4.157196
S  -2.74927 -0.816074 0.999558
H  -3.75513 -1.176001 0.196472
C  1.348775 0.137661 0.005207
O  1.89289 1.242356 0.162587
C  2.190173 -1.115563 -0.106866
H  1.644954 -1.91765 -0.60436
H  3.043134 -0.868848 -0.742125
C  2.661342 -1.620039 1.273581
H  3.487727 -2.319837 1.130963
H  1.86501 -2.179812 1.762619
C  3.063676 -0.52268 2.258336
H  2.163563 0.004349 2.591816
N  3.919122 0.525604 1.609625
H  4.73804 0.127535 1.15405
H  3.27842 1.000548 0.893802
C  3.733015 -1.096981 3.497204
O  3.482739 -2.173187 3.946521
O  4.60888 -0.222593 4.033318
H  4.971941 -0.608976 4.842822
H  4.245291 1.197005 2.302837
totalener: -1406.25127095 hartree
nucrepener: 1817.84309033 hartree
electener: -3224.09436127 hartree
oneelecener: -5520.60407578 hartree
twoeener: 2296.50971451 hartree
kineticenergy: 1400.66094660 hartree
exchangeener: -105.327051688611 hartree
correlationener: -7.052475326549 hartree
xcener: -112.379527015161 hartree
temp: 298.15 k
press: 1.00 atm
thermalcorrenthalpy: 0.00094421 hartree
totalenthalpy: -1406.00095478 hartree
totalentropycorr: -0.06643209 hartree
gibbsenthalpy: -1406.06738687 hartree
gibbsminuselec: 0.26201017 hartree
chargesum: 1.0000000
charge: -0.177505 0.178503 -0.058474 0.133786 0.302216 -0.323078 0.268947 0.057094 -0.431481 -0.154026 0.141700 -0.169496 0.168420 0.113893 0.141876 -0.255260 0.243740 0.119333 -0.147415 0.126467 0.276711 -0.408742 -0.218474 0.120294 0.130429 -0.186006 0.125842 0.134371 -0.012742 0.170511 -0.061761 0.213995 0.225946 0.273749 -0.244898 -0.298628 0.253527 0.226639
charge: 0.343208 -0.022930 -0.030424 0.040537 -0.432261 0.115500 -0.388619 -0.131943 0.068131 0.358846 0.043707 -0.220327 -0.023954 0.005582 0.011669 0.381150 -0.076474 0.034952 0.491986 -0.140908 -0.346822 0.125517 -0.001228 0.037748 0.033844 0.006177 0.036399 0.048073 -0.055616 0.039353 0.598295 0.039764 -0.047630 -0.431135 0.170553 0.351933 -0.070495 0.037843
qa: -0.1775 0.1785 -0.0585 0.1338 0.3022 -0.3231 0.2689 0.0571 -0.4315 -0.1540 0.1417 -0.1695 0.1684 0.1139 0.1419 -0.2553 0.2437 0.1193 -0.1474 0.1265 0.2767 -0.4087 -0.2185 0.1203 0.1304 -0.1860 0.1258 0.1344 -0.0127 0.1705 -0.0618 0.2140 0.2259 0.2737 -0.2449 -0.2986 0.2535 0.2266
va: 3.1881 1.0436 3.8720 1.0082 4.3297 2.1685 4.1509 3.8719 2.0686 3.2881 1.0062 4.0216 1.0569 1.0110 0.9990 2.2375 1.0135 1.0068 2.1767 1.0165 4.1554 2.1049 3.8654 1.0169 1.0141 3.8882 1.0078 1.0201 3.6860 1.0726 3.5760 0.9890 1.0910 4.3959 2.2606 2.1860 1.0102 0.9911
dispcorr: -0.078759177 hartree
energy: -1406.335126515094
dipole: 6.17983 -3.39139 2.78844 -3.12346 3.04664 -0.07682 -7.61601 6.58214 -1.03388
magnitude: 2.97493 au
magnitude: 7.56166 debye
zeropoint: 0.31015073 hartree
thermalvibcorrection: 0.01872544 hartree
thermalrotcorrection: 0.00141627 hartree
thermaltrasncorrection: 0.00141627 hartree
thermaltotal: -1406.00341781 hartree
thermalcorr: 0.02155798 hartree
nonthermalcorr: 0.31015073 hartree
totalcorr: 0.33170871 hartree
totalenthalpy: -1406.00247360 hartree
