program: Orca
programVersion: 5.0.2
elementType: N H C H C O C C O N H C H H H O H H S H C O C H H C H H C H N H H C O O H H
charge: 1
multiplicity: 1
keywords: wB97X-D3BJ Opt Freq def2-TZVPP def2/J RIJCOSX VeryTightSCF
keywords: PAL8 defgrid3 TightOpt
frequency: 0.00 0.00 0.00 0.00 0.00 0.00 24.49 33.62 51.90 59.03 70.26 84.14 96.29 119.02 135.31 142.55 146.36 175.12 195.66 216.61 224.79 246.91 256.31 274.41 289.16 313.39 323.99 325.76 338.43 355.83 409.02 431.77 462.19 494.84 512.90 536.15 586.13 604.40 618.35 624.02 636.15 706.13 727.87 751.02 794.29 806.81 808.30 823.62 864.21 899.07 906.57 911.85 938.96 954.08 968.61 1018.92 1020.34 1045.11 1046.84 1058.09 1089.11 1107.25 1115.76 1158.76 1178.86 1198.93 1216.97 1223.63 1263.20 1269.43 1275.70 1300.01 1315.17 1345.42 1352.44 1371.59 1378.76 1391.84 1404.16 1414.52 1425.57 1443.79 1470.49 1485.46 1488.48 1498.71 1506.26 1554.25 1576.55 1593.88 1639.76 1684.57 1729.15 1746.59 1799.61 1883.78 2766.04 2904.64 3079.62 3108.68 3111.68 3115.74 3119.37 3132.35 3165.45 3169.15 3195.44 3198.95 3228.23 3481.28 3546.62 3588.89 3662.53 3788.19
frequency: 24.49 33.62 51.90 59.03 70.26 84.14 96.29 119.02 135.31 142.55 146.36 175.12 195.66 216.61 224.79 246.91 256.31 274.41 289.16 313.39 323.99 325.76 338.43 355.83 409.02 431.77 462.19 494.84 512.90 536.15 586.13 604.40 618.35 624.02 636.15 706.13 727.87 751.02 794.29 806.81 808.30 823.62 864.21 899.07 906.57 911.85 938.96 954.08 968.61 1018.92 1020.34 1045.11 1046.84 1058.09 1089.11 1107.25 1115.76 1158.76 1178.86 1198.93 1216.97 1223.63 1263.20 1269.43 1275.70 1300.01 1315.17 1345.42 1352.44 1371.59 1378.76 1391.84 1404.16 1414.52 1425.57 1443.79 1470.49 1485.46 1488.48 1498.71 1506.26 1554.25 1576.55 1593.88 1639.76 1684.57 1729.15 1746.59 1799.61 1883.78 2766.04 2904.64 3079.62 3108.68 3111.68 3115.74 3119.37 3132.35 3165.45 3169.15 3195.44 3198.95 3228.23 3481.28 3546.62 3588.89 3662.53 3788.19
formula: C10H18N3O6S
InChI: InChI=1S/C10H18N3O6S/c11-5(10(18)19)1-2-7(14)13-6(4-20)9(17)12-3-8(15)16/h5-6,12-13,15,18,20H,1-4H2,11H3
38 atoms
N  0.36655 2.62226 1.66814
H  1.111789 2.624247 0.983882
C  0.630577 3.124391 3.009527
H  1.410408 3.879173 2.964946
C  1.107603 1.967997 3.879364
O  2.27123 1.831212 4.215404
C  -0.700338 1.839716 1.415862
C  -0.765628 1.251428 0.000909
O  -1.523358 1.548394 2.282463
N  -0.036069 -0.011722 0.028291
H  -0.258324 1.915256 -0.701238
C  -2.209861 1.032774 -0.421204
H  -0.56465 -0.861835 0.138629
H  -2.718816 0.41568 0.31839
H  -2.709683 1.999519 -0.464145
O  0.213033 1.042577 4.170751
H  -0.634703 1.224552 3.683176
H  -0.280934 3.559339 3.421846
S  -2.222916 0.240381 -2.053026
H  -3.552725 0.210657 -2.186764
C  1.310894 -0.062265 0.032362
O  2.011042 0.944911 0.00738
C  1.935773 -1.442262 0.158729
H  1.177331 -2.216307 0.262172
H  2.499669 -1.639172 -0.754311
C  2.906765 -1.449319 1.34703
H  3.727533 -0.766442 1.113731
H  3.320828 -2.44909 1.495977
C  2.233438 -0.937412 2.626116
H  1.727237 -0.00548 2.395109
N  3.230607 -0.603267 3.698939
H  3.311432 -1.363249 4.374991
H  4.1472 -0.415086 3.295678
C  1.173608 -1.894444 3.149602
O  0.141877 -2.088363 2.577996
O  1.55018 -2.505138 4.284484
H  0.847766 -3.107453 4.568876
H  2.906895 0.27825 4.179321
totalener: -1406.24316002 hartree
nucrepener: 1958.26185960 hartree
electener: -3364.50501962 hartree
oneelecener: -5799.65244441 hartree
twoeener: 2435.14742480 hartree
kineticenergy: 1400.66124434 hartree
exchangeener: -105.330087752247 hartree
correlationener: -7.060883574761 hartree
xcener: -112.390971327007 hartree
temp: 298.15 k
press: 1.00 atm
thermalcorrenthalpy: 0.00094421 hartree
totalenthalpy: -1405.99874315 hartree
totalentropycorr: -0.06428827 hartree
gibbsenthalpy: -1406.06303142 hartree
gibbsminuselec: 0.26440797 hartree
chargesum: 1.0000000
charge: -0.183918 0.216665 -0.126916 0.145264 0.344327 -0.364199 0.225416 0.043005 -0.397823 -0.165620 0.151529 -0.175085 0.198179 0.127766 0.122290 -0.265489 0.258071 0.159736 -0.142673 0.121054 0.231288 -0.414679 -0.193577 0.115493 0.138020 -0.180724 0.121205 0.132059 0.032627 0.067834 -0.028536 0.222595 0.222457 0.312942 -0.274834 -0.284768 0.254829 0.234191
charge: 0.342560 -0.020957 -0.025257 0.041124 -0.425303 0.137771 -0.352733 -0.136769 0.124515 0.348754 0.040395 -0.228623 -0.009508 0.008038 0.014087 0.383202 -0.137058 0.040813 0.473493 -0.142012 -0.387844 0.066836 0.010060 0.027401 0.045225 0.005545 0.035692 0.033231 -0.050184 0.036930 0.612613 0.032648 0.046681 -0.432206 0.158568 0.370370 -0.064294 -0.023803
qa: -0.1839 0.2167 -0.1269 0.1453 0.3443 -0.3642 0.2254 0.0430 -0.3978 -0.1656 0.1515 -0.1751 0.1982 0.1278 0.1223 -0.2655 0.2581 0.1597 -0.1427 0.1211 0.2313 -0.4147 -0.1936 0.1155 0.1380 -0.1807 0.1212 0.1321 0.0326 0.0678 -0.0285 0.2226 0.2225 0.3129 -0.2748 -0.2848 0.2548 0.2342
va: 3.2028 1.0176 3.8859 1.0091 4.1630 2.1564 4.1556 3.8191 2.1084 3.1922 1.0137 4.1002 1.0151 1.0105 1.0067 2.2160 1.0622 0.9974 2.1700 1.0201 4.2109 2.1024 3.9255 1.0200 1.0123 3.9515 1.0188 1.0029 3.8983 1.0511 3.5854 1.0027 0.9836 4.2980 2.2171 2.2107 1.0079 1.0774
dispcorr: -0.083933204 hartree
energy: -1406.333878031137
dipole: 5.84104 -3.59817 2.24287 -2.00568 0.80222 -1.20346 0.00941 1.82694 1.83635
magnitude: 3.13862 au
magnitude: 7.97774 debye
zeropoint: 0.31148738 hartree
thermalvibcorrection: 0.01807374 hartree
thermalrotcorrection: 0.00141627 hartree
thermaltrasncorrection: 0.00141627 hartree
thermaltotal: -1406.00148437 hartree
thermalcorr: 0.02090628 hartree
nonthermalcorr: 0.31148738 hartree
totalcorr: 0.33239366 hartree
totalenthalpy: -1406.00054016 hartree
