program: Orca
programVersion: 5.0.2
elementType: N H C H C O C C O N H C H H H O H H S H C O C H H C H H C H N H H C O O H H
charge: 1
multiplicity: 1
keywords: wB97X-D3BJ Opt Freq def2-TZVPP def2/J RIJCOSX VeryTightSCF
keywords: PAL8 defgrid3 TightOpt
frequency: 0.00 0.00 0.00 0.00 0.00 0.00 24.88 36.86 49.11 57.32 72.61 78.52 87.97 107.30 114.84 134.21 147.68 184.84 203.46 225.66 237.78 252.15 260.31 291.64 317.94 323.58 352.65 361.94 382.06 392.81 414.05 453.58 487.45 516.80 542.89 554.70 577.14 596.69 598.53 625.64 650.16 677.87 693.70 722.61 724.49 736.75 761.16 801.22 825.54 837.98 875.97 897.37 904.28 908.20 965.65 1005.76 1014.89 1035.77 1061.48 1073.78 1115.60 1120.84 1142.96 1155.74 1167.67 1193.76 1209.60 1216.42 1255.84 1274.09 1280.87 1292.11 1308.83 1332.44 1337.76 1358.37 1372.56 1378.90 1396.45 1400.67 1414.86 1428.79 1440.26 1472.40 1476.61 1486.48 1492.00 1525.38 1584.53 1587.70 1617.05 1687.78 1722.01 1757.03 1839.41 1888.94 2590.43 2747.19 3081.17 3088.74 3111.61 3116.28 3116.40 3126.53 3139.17 3149.16 3175.70 3186.36 3501.32 3575.64 3593.38 3635.02 3646.03 3811.91
frequency: 24.88 36.86 49.11 57.32 72.61 78.52 87.97 107.30 114.84 134.21 147.68 184.84 203.46 225.66 237.78 252.15 260.31 291.64 317.94 323.58 352.65 361.94 382.06 392.81 414.05 453.58 487.45 516.80 542.89 554.70 577.14 596.69 598.53 625.64 650.16 677.87 693.70 722.61 724.49 736.75 761.16 801.22 825.54 837.98 875.97 897.37 904.28 908.20 965.65 1005.76 1014.89 1035.77 1061.48 1073.78 1115.60 1120.84 1142.96 1155.74 1167.67 1193.76 1209.60 1216.42 1255.84 1274.09 1280.87 1292.11 1308.83 1332.44 1337.76 1358.37 1372.56 1378.90 1396.45 1400.67 1414.86 1428.79 1440.26 1472.40 1476.61 1486.48 1492.00 1525.38 1584.53 1587.70 1617.05 1687.78 1722.01 1757.03 1839.41 1888.94 2590.43 2747.19 3081.17 3088.74 3111.61 3116.28 3116.40 3126.53 3139.17 3149.16 3175.70 3186.36 3501.32 3575.64 3593.38 3635.02 3646.03 3811.91
formula: C10H18N3O6S
InChI: InChI=1S/C10H18N3O6S/c11-5(10(18)19)1-2-7(14)13-6(4-20)9(17)12-3-8(15)16/h5-6,12-13,15,18,20H,1-4H2,11H3
38 atoms
N  -1.322439 2.612216 -1.996125
H  -1.878616 3.215158 -1.407637
C  -1.083538 2.92722 -3.389838
H  -1.339935 2.083846 -4.028823
C  0.374272 3.266061 -3.658751
O  1.035769 2.805275 -4.554614
C  -0.628829 1.598374 -1.452218
C  -0.871506 1.268611 0.039551
O  0.15709 0.936408 -2.114705
N  -0.079939 0.081069 0.349215
H  -1.916749 0.973855 0.150798
C  -0.601417 2.437169 0.999323
H  -0.545574 -0.786307 0.134211
H  -0.488325 2.044595 2.008181
H  0.325325 2.943409 0.739122
O  0.849353 4.170942 -2.790487
H  1.750061 4.390005 -3.062389
H  -1.694358 3.787258 -3.665871
S  -1.884111 3.712547 0.984159
H  -2.859054 2.980632 1.537983
C  1.250613 0.071569 0.111266
O  1.928433 1.098629 0.237554
C  1.820792 -1.263805 -0.314369
H  1.600683 -1.997467 0.466098
H  1.260819 -1.566649 -1.201057
C  3.318892 -1.316301 -0.623656
H  3.530737 -2.319315 -0.993338
H  3.906616 -1.198152 0.291366
C  3.86125 -0.328361 -1.6669
H  4.796514 -0.717173 -2.074826
N  4.168881 0.987452 -1.017412
H  3.308222 1.200234 -0.410327
H  5.001286 0.930287 -0.436699
C  2.927464 -0.113666 -2.86317
O  2.326151 -1.014167 -3.36512
O  2.938069 1.160829 -3.26107
H  2.26042 1.340152 -3.940299
H  4.28659 1.71374 -1.721765
totalener: -1406.24246695 hartree
nucrepener: 1916.86418149 hartree
electener: -3323.10664844 hartree
oneelecener: -5718.11257783 hartree
twoeener: 2395.00592939 hartree
kineticenergy: 1400.65804744 hartree
exchangeener: -105.328152970111 hartree
correlationener: -7.056885301386 hartree
xcener: -112.385038271498 hartree
temp: 298.15 k
press: 1.00 atm
thermalcorrenthalpy: 0.00094421 hartree
totalenthalpy: -1405.99571429 hartree
totalentropycorr: -0.06505172 hartree
gibbsenthalpy: -1406.06076601 hartree
gibbsminuselec: 0.26313893 hartree
chargesum: 1.0000000
charge: -0.198841 0.180848 -0.064870 0.137129 0.324545 -0.348980 0.250511 0.077127 -0.414110 -0.190510 0.129787 -0.176161 0.180436 0.136585 0.132108 -0.258379 0.227102 0.132911 -0.129883 0.109070 0.306556 -0.417327 -0.197446 0.151230 0.155639 -0.239781 0.137935 0.113724 0.018225 0.154087 -0.071999 0.222859 0.214872 0.292748 -0.251076 -0.321274 0.278029 0.216573
charge: 0.334957 -0.060438 -0.030029 0.040782 -0.428958 0.114375 -0.372395 -0.124053 0.094089 0.339774 0.036722 -0.236773 -0.006890 0.012473 0.009810 0.371051 -0.088183 0.039978 0.520947 -0.144734 -0.327973 0.164401 -0.006870 0.043364 0.044337 0.006351 0.047790 0.031608 -0.047813 0.045432 0.593482 -0.074879 0.033573 -0.448855 0.167383 0.367605 -0.085455 0.024015
qa: -0.1988 0.1808 -0.0649 0.1371 0.3245 -0.3490 0.2505 0.0771 -0.4141 -0.1905 0.1298 -0.1762 0.1804 0.1366 0.1321 -0.2584 0.2271 0.1329 -0.1299 0.1091 0.3066 -0.4173 -0.1974 0.1512 0.1556 -0.2398 0.1379 0.1137 0.0182 0.1541 -0.0720 0.2229 0.2149 0.2927 -0.2511 -0.3213 0.2780 0.2166
va: 3.2002 1.0673 3.8346 1.0175 4.2088 2.1386 4.2354 3.8388 2.0847 3.2508 1.0051 3.9400 1.0128 1.0043 1.0142 2.2202 1.0285 0.9995 2.2028 1.0209 4.1722 2.0901 3.7663 0.9984 1.0184 3.9650 1.0046 1.0080 3.7815 0.9981 3.5517 1.1006 0.9846 4.3959 2.2618 2.1746 1.0175 1.0058
dispcorr: -0.082709286 hartree
energy: -1406.334795427427
dipole: 5.22366 -3.20038 2.02328 -6.25794 5.61761 -0.64033 6.91142 -5.20879 1.70263
magnitude: 2.72078 au
magnitude: 6.91567 debye
zeropoint: 0.31066217 hartree
thermalvibcorrection: 0.01793916 hartree
thermalrotcorrection: 0.00141627 hartree
thermaltrasncorrection: 0.00141627 hartree
thermaltotal: -1406.00336156 hartree
thermalcorr: 0.02077170 hartree
nonthermalcorr: 0.31066217 hartree
totalcorr: 0.33143387 hartree
totalenthalpy: -1406.00241735 hartree
