program: Orca
programVersion: 5.0.2
elementType: N H C H C O C C O N H C H H H O H H S H C O C H H C H H C H N H H C O O H H
charge: 1
multiplicity: 1
keywords: wB97X-D3BJ Opt Freq def2-TZVPP def2/J RIJCOSX VeryTightSCF
keywords: PAL8 defgrid3 TightOpt
frequency: 0.00 0.00 0.00 0.00 0.00 0.00 31.79 47.33 57.43 60.93 72.47 78.82 87.87 96.86 112.12 129.77 151.66 167.58 183.75 198.14 211.40 232.98 258.39 285.53 298.58 310.39 342.39 366.33 370.62 434.17 439.42 456.87 488.44 499.59 500.85 542.29 571.74 581.86 613.33 630.92 654.92 678.01 732.17 747.99 760.20 768.42 787.42 808.65 834.01 841.91 872.54 883.50 931.30 934.00 975.58 1007.04 1029.80 1036.20 1048.20 1063.56 1119.92 1133.06 1140.11 1175.55 1192.65 1203.96 1218.86 1227.44 1258.64 1271.63 1306.14 1323.72 1328.63 1329.80 1340.99 1355.66 1374.13 1379.06 1393.20 1408.71 1421.87 1442.57 1461.41 1481.34 1488.85 1490.07 1494.56 1563.20 1571.17 1581.98 1625.64 1702.15 1733.00 1767.86 1812.71 1862.24 2766.80 2964.48 3090.15 3094.38 3111.88 3119.07 3119.50 3131.68 3140.79 3152.22 3177.10 3195.13 3197.98 3509.00 3516.93 3641.79 3672.63 3786.69
frequency: 31.79 47.33 57.43 60.93 72.47 78.82 87.87 96.86 112.12 129.77 151.66 167.58 183.75 198.14 211.40 232.98 258.39 285.53 298.58 310.39 342.39 366.33 370.62 434.17 439.42 456.87 488.44 499.59 500.85 542.29 571.74 581.86 613.33 630.92 654.92 678.01 732.17 747.99 760.20 768.42 787.42 808.65 834.01 841.91 872.54 883.50 931.30 934.00 975.58 1007.04 1029.80 1036.20 1048.20 1063.56 1119.92 1133.06 1140.11 1175.55 1192.65 1203.96 1218.86 1227.44 1258.64 1271.63 1306.14 1323.72 1328.63 1329.80 1340.99 1355.66 1374.13 1379.06 1393.20 1408.71 1421.87 1442.57 1461.41 1481.34 1488.85 1490.07 1494.56 1563.20 1571.17 1581.98 1625.64 1702.15 1733.00 1767.86 1812.71 1862.24 2766.80 2964.48 3090.15 3094.38 3111.88 3119.07 3119.50 3131.68 3140.79 3152.22 3177.10 3195.13 3197.98 3509.00 3516.93 3641.79 3672.63 3786.69
formula: C10H18N3O6S
InChI: InChI=1S/C10H18N3O6S/c11-5(10(18)19)1-2-7(14)13-6(4-20)9(17)12-3-8(15)16/h5-6,12-13,15,18,20H,1-4H2,11H3
38 atoms
N  0.064198 1.530743 2.503578
H  -0.138799 0.550331 2.597583
C  0.813195 2.205606 3.552386
H  0.387118 3.191464 3.739919
C  2.260035 2.307973 3.078433
O  3.115482 1.51088 3.409831
C  -0.193455 2.156912 1.332604
C  -0.740571 1.283132 0.195674
O  0.020924 3.347732 1.169314
N  -0.024554 0.016644 0.13389
H  -0.538592 1.858348 -0.70852
C  -2.249629 1.055855 0.305159
H  -0.53058 -0.825742 0.357576
H  -2.736176 2.021175 0.436497
H  -2.620799 0.621238 -0.62085
O  2.531955 3.254345 2.195573
H  1.703142 3.66015 1.863207
H  0.780404 1.610412 4.460635
S  -2.714792 -0.031741 1.689897
H  -3.282459 -1.000901 0.965874
C  1.316251 0.003763 0.051824
O  1.939728 1.059966 -0.080894
C  2.028357 -1.325718 0.169287
H  1.309887 -2.12928 0.336558
H  2.505763 -1.528797 -0.792756
C  3.062923 -1.350643 1.311253
H  3.286339 -2.394019 1.53234
H  2.639094 -0.922617 2.22305
C  4.418147 -0.677351 1.059052
H  5.083588 -0.947813 1.882414
N  4.336109 0.807099 1.020855
H  3.506293 1.076724 0.436841
H  4.164096 1.192528 1.967684
C  5.107407 -1.115057 -0.22771
O  5.608972 -0.340166 -0.995149
O  5.101811 -2.440398 -0.363651
H  5.597189 -2.671705 -1.162685
H  5.179789 1.19626 0.600944
totalener: -1406.25511740 hartree
nucrepener: 1922.58562680 hartree
electener: -3328.84074420 hartree
oneelecener: -5728.34662405 hartree
twoeener: 2399.50587985 hartree
kineticenergy: 1400.67347837 hartree
exchangeener: -105.332294831484 hartree
correlationener: -7.060678849308 hartree
xcener: -112.392973680792 hartree
temp: 298.15 k
press: 1.00 atm
thermalcorrenthalpy: 0.00094421 hartree
totalenthalpy: -1406.01009278 hartree
totalentropycorr: -0.06435235 hartree
gibbsenthalpy: -1406.07444513 hartree
gibbsminuselec: 0.26445931 hartree
chargesum: 1.0000000
charge: -0.195042 0.177059 -0.130330 0.160864 0.327116 -0.369841 0.267704 0.037967 -0.373274 -0.186715 0.147354 -0.172785 0.165697 0.146743 0.147076 -0.245123 0.257135 0.138296 -0.153497 0.125696 0.257292 -0.412332 -0.162911 0.114637 0.119673 -0.197060 0.150668 0.115338 0.020273 0.150748 -0.081235 0.221781 0.223963 0.271735 -0.282932 -0.256449 0.253753 0.220959
charge: 0.334268 -0.036818 -0.027931 0.037025 -0.430291 0.114322 -0.377482 -0.127170 0.117835 0.344877 0.051627 -0.214813 -0.033339 0.022063 0.015506 0.391834 -0.112432 0.038779 0.490084 -0.145845 -0.357671 0.139277 0.001150 0.034467 0.041649 0.004663 0.044176 0.031164 -0.057281 0.051734 0.604759 -0.039259 -0.010277 -0.441858 0.141536 0.391439 -0.067444 0.035678
qa: -0.1950 0.1771 -0.1303 0.1609 0.3271 -0.3698 0.2677 0.0380 -0.3733 -0.1867 0.1474 -0.1728 0.1657 0.1467 0.1471 -0.2451 0.2571 0.1383 -0.1535 0.1257 0.2573 -0.4123 -0.1629 0.1146 0.1197 -0.1971 0.1507 0.1153 0.0203 0.1507 -0.0812 0.2218 0.2240 0.2717 -0.2829 -0.2564 0.2538 0.2210
va: 3.1562 1.0413 3.8939 1.0001 4.1674 2.1266 4.1545 3.8841 2.1532 3.1824 1.0200 3.9277 1.0582 1.0030 0.9912 2.2364 1.0425 1.0106 2.1862 1.0156 4.1508 2.0971 3.8431 1.0122 1.0201 3.8899 1.0075 1.0255 3.8697 1.0025 3.5800 1.0862 1.0627 4.3815 2.2093 2.2457 1.0057 0.9979
dispcorr: -0.083900610 hartree
energy: -1406.347355390268
dipole: -1.57918 1.85240 0.27322 -6.25658 3.96733 -2.28924 0.15592 -0.26360 -0.10768
magnitude: 2.30800 au
magnitude: 5.86648 debye
zeropoint: 0.31137697 hartree
thermalvibcorrection: 0.01804254 hartree
thermalrotcorrection: 0.00141627 hartree
thermaltrasncorrection: 0.00141627 hartree
thermaltotal: -1406.01510333 hartree
thermalcorr: 0.02087509 hartree
nonthermalcorr: 0.31137697 hartree
totalcorr: 0.33225206 hartree
totalenthalpy: -1406.01415912 hartree
