program: Orca
programVersion: 5.0.2
elementType: N H C H C O C C O N H C H H H O H H S H C O C H H C H H C H N H H C O O H H
charge: 1
multiplicity: 1
keywords: wB97X-D3BJ Opt Freq def2-TZVPP def2/J RIJCOSX VeryTightSCF
keywords: PAL8 defgrid3 TightOpt
frequency: 0.00 0.00 0.00 0.00 0.00 0.00 19.20 25.46 43.18 44.83 51.36 70.13 70.63 89.62 95.16 113.77 136.64 156.25 177.94 209.39 223.06 272.76 290.56 306.94 319.88 335.48 338.39 371.69 390.87 398.97 433.55 448.65 495.71 508.21 509.75 519.78 547.01 589.98 622.44 644.36 651.24 662.70 679.66 699.65 726.16 741.25 766.38 793.66 810.78 821.50 881.00 895.82 930.88 942.98 969.83 1012.63 1031.20 1043.95 1053.67 1079.54 1103.61 1123.46 1151.80 1167.35 1187.39 1194.62 1214.45 1233.57 1264.33 1266.74 1274.88 1278.48 1304.51 1328.13 1337.07 1343.32 1362.22 1378.82 1392.59 1410.78 1431.91 1447.29 1463.56 1469.23 1481.99 1494.65 1500.13 1515.12 1582.46 1602.46 1649.09 1686.19 1718.69 1774.03 1850.65 1853.39 2725.38 2734.94 3085.98 3098.90 3102.64 3106.19 3116.35 3119.11 3146.09 3159.67 3164.69 3170.53 3495.06 3550.10 3585.70 3686.71 3787.98 3802.54
frequency: 19.20 25.46 43.18 44.83 51.36 70.13 70.63 89.62 95.16 113.77 136.64 156.25 177.94 209.39 223.06 272.76 290.56 306.94 319.88 335.48 338.39 371.69 390.87 398.97 433.55 448.65 495.71 508.21 509.75 519.78 547.01 589.98 622.44 644.36 651.24 662.70 679.66 699.65 726.16 741.25 766.38 793.66 810.78 821.50 881.00 895.82 930.88 942.98 969.83 1012.63 1031.20 1043.95 1053.67 1079.54 1103.61 1123.46 1151.80 1167.35 1187.39 1194.62 1214.45 1233.57 1264.33 1266.74 1274.88 1278.48 1304.51 1328.13 1337.07 1343.32 1362.22 1378.82 1392.59 1410.78 1431.91 1447.29 1463.56 1469.23 1481.99 1494.65 1500.13 1515.12 1582.46 1602.46 1649.09 1686.19 1718.69 1774.03 1850.65 1853.39 2725.38 2734.94 3085.98 3098.90 3102.64 3106.19 3116.35 3119.11 3146.09 3159.67 3164.69 3170.53 3495.06 3550.10 3585.70 3686.71 3787.98 3802.54
formula: C10H18N3O6S
InChI: InChI=1S/C10H18N3O6S/c11-5(10(18)19)1-2-7(14)13-6(4-20)9(17)12-3-8(15)16/h5-6,12-13,15,18,20H,1-4H2,11H3
38 atoms
N  -1.247434 2.476606 2.376626
H  -1.92078 2.939984 1.792393
C  -1.308994 2.708555 3.797821
H  -0.316034 2.616595 4.236713
C  -2.23277 1.717507 4.490617
O  -2.887203 0.87895 3.930585
C  -0.587299 1.402682 1.890886
C  -0.8086 1.116829 0.39199
O  0.144416 0.713474 2.581636
N  0.009198 -0.008443 0.001914
H  -0.485342 1.996975 -0.168637
C  -2.275388 0.812248 0.063003
H  -0.430729 -0.912145 0.115358
H  -2.92198 1.634382 0.364335
H  -2.377436 0.703409 -1.016995
O  -2.228586 1.909904 5.812504
H  -2.837561 1.274985 6.213605
H  -1.666171 3.719511 3.994772
S  -2.876512 -0.736354 0.777611
H  -2.870179 -0.33131 2.056595
C  1.340125 0.066152 0.015616
O  1.941239 1.14932 0.079354
C  2.114192 -1.235948 -0.009143
H  1.516354 -2.045313 -0.428234
H  2.965589 -1.090064 -0.676738
C  2.58734 -1.649975 1.400564
H  3.359716 -2.416371 1.297375
H  1.764309 -2.101073 1.953971
C  3.098199 -0.493895 2.265667
H  2.245339 0.111946 2.584945
N  3.997617 0.418841 1.496295
H  4.753061 -0.092361 1.043164
H  3.370931 0.896533 0.779145
C  3.864772 -0.944363 3.496456
O  4.949928 -0.507163 3.776989
O  3.187259 -1.843291 4.200929
H  3.704758 -2.081276 4.983748
H  4.436963 1.087455 2.128805
totalener: -1406.25793114 hartree
nucrepener: 1858.52687552 hartree
electener: -3264.78480666 hartree
oneelecener: -5601.87959144 hartree
twoeener: 2337.09478478 hartree
kineticenergy: 1400.67916248 hartree
exchangeener: -105.331369739620 hartree
correlationener: -7.055237876561 hartree
xcener: -112.386607616182 hartree
temp: 298.15 k
press: 1.00 atm
thermalcorrenthalpy: 0.00094421 hartree
totalenthalpy: -1406.00884894 hartree
totalentropycorr: -0.06559027 hartree
gibbsenthalpy: -1406.07443921 hartree
gibbsminuselec: 0.26343177 hartree
chargesum: 1.0000000
charge: -0.188993 0.178134 -0.077224 0.125461 0.323903 -0.337408 0.237711 0.070299 -0.423466 -0.146620 0.143274 -0.158258 0.163794 0.108507 0.142121 -0.258466 0.243173 0.144810 -0.160654 0.151069 0.269942 -0.412559 -0.219085 0.121682 0.131061 -0.201305 0.125911 0.133039 0.002779 0.164397 -0.056393 0.215533 0.226736 0.279269 -0.300309 -0.242491 0.251341 0.229287
charge: 0.337892 -0.019738 -0.040195 0.039031 -0.433528 0.112371 -0.373486 -0.130012 0.079976 0.357220 0.043020 -0.238490 -0.029284 0.003874 0.017852 0.378765 -0.078551 0.039139 0.501574 -0.143274 -0.351148 0.118476 -0.000606 0.038164 0.033593 0.003748 0.035021 0.045037 -0.057653 0.040393 0.604738 0.044394 -0.042670 -0.440687 0.126215 0.400411 -0.066263 0.044680
qa: -0.1890 0.1781 -0.0772 0.1255 0.3239 -0.3374 0.2377 0.0703 -0.4235 -0.1466 0.1433 -0.1583 0.1638 0.1085 0.1421 -0.2585 0.2432 0.1448 -0.1607 0.1511 0.2699 -0.4126 -0.2191 0.1217 0.1311 -0.2013 0.1259 0.1330 0.0028 0.1644 -0.0564 0.2155 0.2267 0.2793 -0.3003 -0.2425 0.2513 0.2293
va: 3.2090 1.0182 3.8299 1.0232 4.2472 2.1317 4.2168 3.8111 2.0707 3.2759 1.0099 3.9695 1.0690 1.0137 1.0015 2.2299 1.0144 1.0038 2.1787 1.0297 4.1631 2.0999 3.8652 1.0169 1.0140 3.8524 1.0047 1.0204 3.7336 1.0560 3.6285 0.9909 1.0854 4.4198 2.1981 2.2549 1.0074 0.9894
dispcorr: -0.080393080 hartree
energy: -1406.343756336074
dipole: 5.64812 -3.33550 2.31262 0.02549 0.09996 0.12545 -6.17416 5.65632 -0.51784
magnitude: 2.37320 au
magnitude: 6.03220 debye
zeropoint: 0.31106936 hartree
thermalvibcorrection: 0.01829915 hartree
thermalrotcorrection: 0.00141627 hartree
thermaltrasncorrection: 0.00141627 hartree
thermaltotal: -1406.01155528 hartree
thermalcorr: 0.02113169 hartree
nonthermalcorr: 0.31106936 hartree
totalcorr: 0.33220105 hartree
totalenthalpy: -1406.01061108 hartree
