program: Orca
programVersion: 5.0.2
elementType: N H C H C O C C O N H C H H H O H H S H C O C H H C H H C H N H H C O O H H
charge: 1
multiplicity: 1
keywords: wB97X-D3BJ Opt Freq def2-TZVPP def2/J RIJCOSX VeryTightSCF
keywords: PAL8 defgrid3 TightOpt
frequency: 0.00 0.00 0.00 0.00 0.00 0.00 23.12 28.41 40.41 49.03 68.83 80.46 97.98 116.52 119.32 131.70 154.97 170.31 183.63 196.22 210.62 224.57 231.88 252.29 273.68 320.89 332.91 350.82 380.70 395.31 425.94 428.35 460.95 496.57 510.25 541.41 564.55 567.49 591.12 625.55 628.65 661.90 692.11 726.34 751.05 766.07 781.13 814.30 845.93 854.69 892.05 902.08 919.02 935.94 958.18 986.97 996.47 1038.58 1057.05 1079.27 1108.10 1123.54 1129.16 1150.32 1157.95 1186.76 1197.49 1213.34 1233.37 1280.52 1295.26 1297.74 1310.87 1322.22 1332.56 1364.29 1369.22 1373.64 1387.07 1397.26 1418.41 1438.61 1443.45 1492.36 1502.55 1504.11 1507.93 1560.09 1580.65 1618.08 1627.28 1654.21 1726.71 1751.78 1833.23 1890.14 2764.39 3089.90 3096.76 3097.33 3097.79 3101.30 3120.45 3150.90 3154.65 3159.80 3180.08 3246.96 3294.75 3532.55 3534.75 3681.90 3795.72 3804.56
frequency: 23.12 28.41 40.41 49.03 68.83 80.46 97.98 116.52 119.32 131.70 154.97 170.31 183.63 196.22 210.62 224.57 231.88 252.29 273.68 320.89 332.91 350.82 380.70 395.31 425.94 428.35 460.95 496.57 510.25 541.41 564.55 567.49 591.12 625.55 628.65 661.90 692.11 726.34 751.05 766.07 781.13 814.30 845.93 854.69 892.05 902.08 919.02 935.94 958.18 986.97 996.47 1038.58 1057.05 1079.27 1108.10 1123.54 1129.16 1150.32 1157.95 1186.76 1197.49 1213.34 1233.37 1280.52 1295.26 1297.74 1310.87 1322.22 1332.56 1364.29 1369.22 1373.64 1387.07 1397.26 1418.41 1438.61 1443.45 1492.36 1502.55 1504.11 1507.93 1560.09 1580.65 1618.08 1627.28 1654.21 1726.71 1751.78 1833.23 1890.14 2764.39 3089.90 3096.76 3097.33 3097.79 3101.30 3120.45 3150.90 3154.65 3159.80 3180.08 3246.96 3294.75 3532.55 3534.75 3681.90 3795.72 3804.56
formula: C10H18N3O6S
InChI: InChI=1S/C10H18N3O6S/c11-5(10(18)19)1-2-7(14)13-6(4-20)9(17)12-3-8(15)16/h5-6,12-13,15,18,20H,1-4H2,11H3
38 atoms
N  -0.136894 3.10967 -1.85644
H  -0.636136 3.693253 -1.196541
C  0.655012 3.760936 -2.888396
H  0.154555 4.687053 -3.172679
C  0.847722 2.918789 -4.141836
O  1.9197 2.497402 -4.503082
C  -0.103687 1.791617 -1.647757
C  -0.719542 1.239482 -0.339287
O  0.400359 1.005853 -2.449599
N  0.020231 0.031068 0.000341
H  -1.739149 0.925086 -0.579196
C  -0.759727 2.208099 0.84877
H  -0.451727 -0.850634 -0.100639
H  -0.955084 1.625674 1.74684
H  0.201294 2.706738 0.955787
O  -0.28609 2.767944 -4.821983
H  -0.10309 2.236814 -5.608782
H  1.64924 3.99994 -2.507667
S  -2.094649 3.42156 0.619684
H  -1.721858 4.250313 1.600584
C  1.369126 0.032256 -0.022557
O  2.011549 1.083752 -0.025488
C  2.053513 -1.308225 -0.160988
H  2.968893 -1.28719 0.432289
H  1.420823 -2.107604 0.227955
C  2.366312 -1.611901 -1.638188
H  1.46422 -1.506801 -2.246112
H  2.681201 -2.651501 -1.721076
C  3.491284 -0.788258 -2.264316
H  4.370991 -0.798489 -1.614028
N  3.123559 0.648857 -2.455032
H  2.18684 0.760534 -2.875751
H  3.03172 1.090819 -1.524585
C  3.938026 -1.396996 -3.59596
O  3.863744 -2.56046 -3.851373
O  4.46306 -0.462323 -4.405527
H  4.76604 -0.888125 -5.219696
H  3.791857 1.138371 -3.048291
totalener: -1406.24845139 hartree
nucrepener: 1902.64673550 hartree
electener: -3308.89518688 hartree
oneelecener: -5689.23156963 hartree
twoeener: 2380.33638275 hartree
kineticenergy: 1400.66919895 hartree
exchangeener: -105.330838630991 hartree
correlationener: -7.057118153705 hartree
xcener: -112.387956784696 hartree
temp: 298.15 k
press: 1.00 atm
thermalcorrenthalpy: 0.00094421 hartree
totalenthalpy: -1406.00118401 hartree
totalentropycorr: -0.06515214 hartree
gibbsenthalpy: -1406.06633615 hartree
gibbsminuselec: 0.26448665 hartree
chargesum: 1.0000000
charge: -0.148874 0.172160 -0.103313 0.144802 0.326853 -0.360516 0.279877 0.077176 -0.480029 -0.171769 0.134160 -0.197920 0.184179 0.128368 0.148455 -0.234482 0.236092 0.128744 -0.143753 0.127709 0.245111 -0.426900 -0.170706 0.121927 0.117933 -0.186162 0.120483 0.148631 -0.000236 0.140183 -0.053343 0.239266 0.224677 0.277160 -0.249824 -0.280514 0.251490 0.232905
charge: 0.348235 -0.060351 -0.023411 0.040949 -0.451200 0.086007 -0.365165 -0.119886 0.084868 0.353652 0.042400 -0.223149 -0.013404 0.009055 0.005982 0.391404 -0.077450 0.030140 0.513694 -0.138118 -0.364094 0.089201 -0.000208 0.039786 0.035327 0.005622 0.034492 0.045453 -0.049055 0.048615 0.606033 0.005539 -0.001134 -0.428358 0.166130 0.366460 -0.068700 0.034640
qa: -0.1489 0.1722 -0.1033 0.1448 0.3269 -0.3605 0.2799 0.0772 -0.4800 -0.1718 0.1342 -0.1979 0.1842 0.1284 0.1485 -0.2345 0.2361 0.1287 -0.1438 0.1277 0.2451 -0.4269 -0.1707 0.1219 0.1179 -0.1862 0.1205 0.1486 -0.0002 0.1402 -0.0533 0.2393 0.2247 0.2772 -0.2498 -0.2805 0.2515 0.2329
va: 3.2050 1.0787 3.8502 1.0003 4.3061 2.1249 4.1535 3.8443 2.0031 3.2126 1.0002 3.9711 1.0112 1.0080 1.0080 2.2571 1.0195 1.0071 2.1958 1.0168 4.1943 2.0656 3.8421 1.0229 1.0108 3.8627 1.0250 1.0213 3.8331 1.0060 3.5951 1.0387 1.0406 4.3665 2.2477 2.2042 1.0112 0.9906
dispcorr: -0.082727110 hartree
energy: -1406.336438281223
dipole: 2.43911 -1.72568 0.71343 -2.27910 2.11395 -0.16515 6.67059 -6.15336 0.51723
magnitude: 0.89654 au
magnitude: 2.27881 debye
zeropoint: 0.31124179 hartree
thermalvibcorrection: 0.01839389 hartree
thermalrotcorrection: 0.00141627 hartree
thermaltrasncorrection: 0.00141627 hartree
thermaltotal: -1406.00397007 hartree
thermalcorr: 0.02122643 hartree
nonthermalcorr: 0.31124179 hartree
totalcorr: 0.33246821 hartree
totalenthalpy: -1406.00302586 hartree
