program: Orca
programVersion: 5.0.2
elementType: N H C H C O C C O N H C H H H O H H S H C O C H H C H H C H N H H C O O H H
charge: 1
multiplicity: 1
keywords: wB97X-D3BJ Opt Freq def2-TZVPP def2/J RIJCOSX VeryTightSCF
keywords: PAL8 defgrid3 TightOpt
frequency: 0.00 0.00 0.00 0.00 0.00 0.00 -25.12 29.29 40.44 48.85 54.47 83.15 95.27 105.96 118.98 129.00 141.41 170.93 172.86 193.04 216.23 240.54 255.98 260.09 287.51 304.76 315.73 341.41 351.52 388.73 401.71 424.46 447.36 468.67 485.81 508.19 533.31 561.39 619.07 624.24 660.21 686.62 738.99 767.06 792.47 795.66 797.71 807.19 846.64 866.71 874.50 907.02 936.28 963.78 975.00 987.86 1012.16 1028.24 1049.04 1054.04 1090.74 1110.41 1137.66 1160.24 1172.42 1181.18 1206.91 1217.80 1247.78 1273.80 1276.45 1304.57 1319.87 1334.37 1343.96 1363.33 1370.44 1373.81 1388.27 1398.31 1438.94 1450.09 1462.02 1482.09 1493.26 1494.17 1506.35 1547.55 1556.23 1566.57 1658.23 1700.48 1751.65 1782.66 1803.97 1883.37 2769.26 2822.78 3102.71 3103.39 3110.71 3112.90 3113.90 3126.77 3169.03 3185.80 3195.06 3204.28 3363.59 3485.78 3551.52 3683.94 3690.11 3787.64
frequency: 29.29 40.44 48.85 54.47 83.15 95.27 105.96 118.98 129.00 141.41 170.93 172.86 193.04 216.23 240.54 255.98 260.09 287.51 304.76 315.73 341.41 351.52 388.73 401.71 424.46 447.36 468.67 485.81 508.19 533.31 561.39 619.07 624.24 660.21 686.62 738.99 767.06 792.47 795.66 797.71 807.19 846.64 866.71 874.50 907.02 936.28 963.78 975.00 987.86 1012.16 1028.24 1049.04 1054.04 1090.74 1110.41 1137.66 1160.24 1172.42 1181.18 1206.91 1217.80 1247.78 1273.80 1276.45 1304.57 1319.87 1334.37 1343.96 1363.33 1370.44 1373.81 1388.27 1398.31 1438.94 1450.09 1462.02 1482.09 1493.26 1494.17 1506.35 1547.55 1556.23 1566.57 1658.23 1700.48 1751.65 1782.66 1803.97 1883.37 2769.26 2822.78 3102.71 3103.39 3110.71 3112.90 3113.90 3126.77 3169.03 3185.80 3195.06 3204.28 3363.59 3485.78 3551.52 3683.94 3690.11 3787.64
formula: C10H18N3O6S
InChI: InChI=1S/C10H18N3O6S/c11-5(10(18)19)1-2-7(14)13-6(4-20)9(17)12-3-8(15)16/h5-6,12-13,15,18,20H,1-4H2,11H3
38 atoms
N  -0.346876 0.863476 -2.678504
H  -0.725364 -0.056292 -2.533757
C  0.116671 1.224446 -4.008593
H  -0.323322 0.553527 -4.741079
C  1.633213 1.079143 -4.054653
O  2.182371 0.151442 -4.631269
C  -0.191606 1.708316 -1.623287
C  -0.663635 1.143702 -0.270773
O  0.329134 2.803497 -1.766156
N  0.146261 -0.040281 0.017311
H  -1.688821 0.785632 -0.392433
C  -0.648947 2.20309 0.822435
H  -0.289119 -0.944487 -0.021528
H  0.337147 2.648866 0.900912
H  -1.373644 2.973582 0.563671
O  2.330173 1.947221 -3.359434
H  1.730757 2.533966 -2.836401
H  -0.171859 2.253218 -4.230718
S  -1.130997 1.396989 2.375203
H  -1.523855 2.508188 3.004945
C  1.506809 0.03711 0.111384
O  2.093921 1.089467 0.247578
C  2.274508 -1.237459 -0.219235
H  3.073421 -1.389661 0.50598
H  1.631664 -2.11597 -0.250934
C  2.829677 -0.888565 -1.608215
H  3.560838 -0.0876 -1.480765
H  2.010276 -0.477538 -2.193164
C  3.433424 -2.002891 -2.440429
H  4.161497 -2.602442 -1.888786
N  4.155943 -1.371102 -3.605274
H  3.510192 -0.67728 -4.079393
H  4.982897 -0.869616 -3.28485
C  2.372529 -2.94642 -3.012686
O  1.238792 -2.993757 -2.637582
O  2.896159 -3.707995 -3.985198
H  2.215286 -4.304568 -4.328248
H  4.439421 -2.075961 -4.286525
totalener: -1406.22386530 hartree
nucrepener: 1902.90248600 hartree
electener: -3309.12635130 hartree
oneelecener: -5689.83652681 hartree
twoeener: 2380.71017550 hartree
kineticenergy: 1400.63793706 hartree
exchangeener: -105.319979040514 hartree
correlationener: -7.056540871535 hartree
xcener: -112.376519912049 hartree
temp: 298.15 k
press: 1.00 atm
thermalcorrenthalpy: 0.00094421 hartree
totalenthalpy: -1405.97745653 hartree
totalentropycorr: -0.06524292 hartree
gibbsenthalpy: -1406.04269944 hartree
gibbsminuselec: 0.26349772 hartree
chargesum: 1.0000000
charge: -0.215987 0.190289 -0.141131 0.140995 0.369311 -0.387124 0.267380 0.014304 -0.367538 -0.257276 0.148666 -0.153983 0.188705 0.136673 0.126272 -0.226660 0.263626 0.163121 -0.157260 0.117000 0.264913 -0.334529 -0.200219 0.126181 0.108490 -0.149743 0.150259 0.026642 0.010656 0.163749 -0.067613 0.228494 0.227463 0.292031 -0.271808 -0.283642 0.257808 0.231486
charge: 0.328684 -0.020838 -0.030849 0.038589 -0.424302 0.128844 -0.352027 -0.145359 0.135822 0.326719 0.039672 -0.223048 -0.028725 0.005156 0.010717 0.405033 -0.112248 0.040204 0.467677 -0.145677 -0.386036 0.122075 0.010816 0.034599 0.021534 -0.015416 0.039230 0.026353 -0.044521 0.046700 0.606281 -0.027803 0.048029 -0.427940 0.157202 0.369996 -0.065967 0.040824
qa: -0.2160 0.1903 -0.1411 0.1410 0.3693 -0.3871 0.2674 0.0143 -0.3675 -0.2573 0.1487 -0.1540 0.1887 0.1367 0.1263 -0.2267 0.2636 0.1631 -0.1573 0.1170 0.2649 -0.3345 -0.2002 0.1262 0.1085 -0.1497 0.1503 0.0266 0.0107 0.1637 -0.0676 0.2285 0.2275 0.2920 -0.2718 -0.2836 0.2578 0.2315
va: 3.1661 1.0133 3.9004 1.0087 4.1424 2.1328 4.1718 3.8687 2.1414 3.0934 1.0089 4.0315 1.0074 1.0223 1.0067 2.2711 1.0477 1.0001 2.1683 1.0203 4.2355 2.1940 3.9614 1.0247 1.0297 3.8564 1.0252 1.0763 3.8173 1.0018 3.5630 1.0944 0.9778 4.3196 2.2168 2.2130 1.0046 0.9886
dispcorr: -0.082961636 hartree
energy: -1406.312157835132
dipole: 3.61285 -1.74475 1.86810 -2.86928 -0.02993 -2.89922 -2.59860 -0.34723 -2.94583
magnitude: 4.53577 au
magnitude: 11.52900 debye
zeropoint: 0.31073447 hartree
thermalvibcorrection: 0.01760912 hartree
thermalrotcorrection: 0.00141627 hartree
thermaltrasncorrection: 0.00141627 hartree
thermaltotal: -1405.98098170 hartree
thermalcorr: 0.02044166 hartree
nonthermalcorr: 0.31073447 hartree
totalcorr: 0.33117614 hartree
totalenthalpy: -1405.98003749 hartree
