program: Orca
programVersion: 5.0.2
elementType: N H C H C O C C O N H C H H H O H H S H C O C H H C H H C H N H H C O O H H
charge: 1
multiplicity: 1
keywords: wB97X-D3BJ Opt Freq def2-TZVPP def2/J RIJCOSX VeryTightSCF
keywords: PAL8 defgrid3 TightOpt
frequency: 0.00 0.00 0.00 0.00 0.00 0.00 15.50 35.76 51.54 60.09 63.32 70.67 78.97 99.52 117.81 126.07 131.82 155.90 181.36 200.01 208.12 233.72 276.66 283.63 296.48 308.18 328.00 335.67 369.45 410.43 428.88 491.04 493.04 523.46 526.07 561.39 582.27 588.80 633.31 637.91 664.83 669.79 693.36 713.15 725.87 744.91 783.54 802.44 820.21 857.37 888.09 898.98 917.94 965.23 977.24 1000.34 1015.40 1025.78 1050.72 1073.34 1108.17 1132.65 1148.14 1179.17 1183.63 1207.77 1228.92 1250.81 1252.58 1262.56 1269.52 1282.23 1293.41 1312.82 1328.10 1353.22 1364.95 1376.58 1389.86 1405.62 1436.52 1465.03 1467.13 1477.00 1487.24 1498.94 1499.10 1510.03 1584.62 1588.86 1607.45 1687.42 1710.91 1770.22 1836.18 1849.33 2744.90 2770.80 3087.20 3093.63 3099.89 3107.91 3117.17 3118.30 3132.37 3145.72 3163.03 3171.58 3456.91 3486.92 3573.74 3589.10 3619.22 3801.78
frequency: 15.50 35.76 51.54 60.09 63.32 70.67 78.97 99.52 117.81 126.07 131.82 155.90 181.36 200.01 208.12 233.72 276.66 283.63 296.48 308.18 328.00 335.67 369.45 410.43 428.88 491.04 493.04 523.46 526.07 561.39 582.27 588.80 633.31 637.91 664.83 669.79 693.36 713.15 725.87 744.91 783.54 802.44 820.21 857.37 888.09 898.98 917.94 965.23 977.24 1000.34 1015.40 1025.78 1050.72 1073.34 1108.17 1132.65 1148.14 1179.17 1183.63 1207.77 1228.92 1250.81 1252.58 1262.56 1269.52 1282.23 1293.41 1312.82 1328.10 1353.22 1364.95 1376.58 1389.86 1405.62 1436.52 1465.03 1467.13 1477.00 1487.24 1498.94 1499.10 1510.03 1584.62 1588.86 1607.45 1687.42 1710.91 1770.22 1836.18 1849.33 2744.90 2770.80 3087.20 3093.63 3099.89 3107.91 3117.17 3118.30 3132.37 3145.72 3163.03 3171.58 3456.91 3486.92 3573.74 3589.10 3619.22 3801.78
formula: C10H18N3O6S
InChI: InChI=1S/C10H18N3O6S/c11-5(10(18)19)1-2-7(14)13-6(4-20)9(17)12-3-8(15)16/h5-6,12-13,15,18,20H,1-4H2,11H3
38 atoms
N  -3.027703 1.709011 0.847321
H  -2.709009 2.659744 0.966816
C  -4.406058 1.458789 1.205287
H  -4.966379 1.037662 0.367774
C  -5.026766 2.776176 1.614489
O  -4.426877 3.819788 1.635105
C  -2.21669 0.733921 0.420953
C  -0.809881 1.172622 -0.000831
O  -2.556574 -0.435436 0.306219
N  0.005275 -0.022597 0.022651
H  -0.406737 1.900743 0.706304
C  -0.852425 1.834801 -1.388458
H  -0.522442 -0.885776 0.001502
H  -1.511057 2.702113 -1.351308
H  0.144635 2.182616 -1.654892
O  -6.309383 2.631766 1.94665
H  -6.65649 3.497631 2.201497
H  -4.483755 0.749168 2.032245
S  -1.365449 0.758984 -2.755284
H  -2.37878 0.135582 -2.139956
C  1.332825 -0.020544 -0.000497
O  1.988047 1.036577 0.020218
C  1.998602 -1.379011 -0.071128
H  2.229793 -1.679824 0.953652
H  1.286424 -2.102938 -0.462539
C  3.296339 -1.424307 -0.903819
H  3.397253 -2.433065 -1.3026
H  4.163669 -1.274914 -0.255864
C  3.435617 -0.446283 -2.079682
H  4.130594 -0.854746 -2.816191
N  3.986894 0.864455 -1.607872
H  3.856922 1.566044 -2.340856
H  3.361056 1.126796 -0.788126
C  2.148244 -0.068498 -2.818647
O  1.97849 1.048873 -3.237209
O  1.294036 -1.068395 -2.907625
H  0.422638 -0.706145 -3.183692
H  4.96387 0.801911 -1.3361
totalener: -1406.25251062 hartree
nucrepener: 1854.39206487 hartree
electener: -3260.64457550 hartree
oneelecener: -5593.20171743 hartree
twoeener: 2332.55714193 hartree
kineticenergy: 1400.66066322 hartree
exchangeener: -105.328954204319 hartree
correlationener: -7.059256208552 hartree
xcener: -112.388210412871 hartree
temp: 298.15 k
press: 1.00 atm
thermalcorrenthalpy: 0.00094421 hartree
totalenthalpy: -1406.00631241 hartree
totalentropycorr: -0.06515796 hartree
gibbsenthalpy: -1406.07147037 hartree
gibbsminuselec: 0.26291031 hartree
chargesum: 1.0000000
charge: -0.186651 0.182612 -0.060497 0.131611 0.303354 -0.325521 0.230871 0.021367 -0.387090 -0.141829 0.128483 -0.161255 0.194952 0.139701 0.138753 -0.251946 0.242945 0.134794 -0.158740 0.133082 0.242336 -0.439180 -0.143656 0.141441 0.129556 -0.235243 0.135597 0.114482 0.024932 0.160875 -0.070941 0.227704 0.233023 0.286324 -0.315728 -0.264265 0.245525 0.218220
charge: 0.341729 -0.021251 -0.027306 0.039090 -0.432974 0.113376 -0.395929 -0.120806 0.078828 0.368534 0.041011 -0.227579 -0.014294 0.010370 0.009388 0.383455 -0.076460 0.040453 0.543441 -0.140015 -0.359000 0.115113 -0.000271 0.044123 0.034005 0.006925 0.044203 0.032091 -0.047312 0.045911 0.601854 0.036287 -0.046911 -0.456674 0.131256 0.398616 -0.127606 0.034330
qa: -0.1867 0.1826 -0.0605 0.1316 0.3034 -0.3255 0.2309 0.0214 -0.3871 -0.1418 0.1285 -0.1613 0.1950 0.1397 0.1388 -0.2519 0.2429 0.1348 -0.1587 0.1331 0.2423 -0.4392 -0.1437 0.1414 0.1296 -0.2352 0.1356 0.1145 0.0249 0.1609 -0.0709 0.2277 0.2330 0.2863 -0.3157 -0.2643 0.2455 0.2182
va: 3.2041 1.0411 3.8602 1.0085 4.3214 2.1660 4.2645 3.9594 2.1192 3.2689 1.0196 3.8623 1.0409 1.0131 1.0150 2.2413 1.0141 1.0061 2.2207 1.0286 4.1689 2.0690 3.7831 1.0055 1.0216 3.9155 1.0065 1.0051 3.8232 0.9933 3.5941 1.0019 1.0761 4.3604 2.1786 2.2506 1.0707 0.9837
dispcorr: -0.081950265 hartree
energy: -1406.340770511913
dipole: 13.20377 -9.10873 4.09504 -5.02905 4.27755 -0.75150 0.91563 -1.04292 -0.12729
magnitude: 4.16537 au
magnitude: 10.58753 debye
zeropoint: 0.31046914 hartree
thermalvibcorrection: 0.01823293 hartree
thermalrotcorrection: 0.00141627 hartree
thermaltrasncorrection: 0.00141627 hartree
thermaltotal: -1406.00923590 hartree
thermalcorr: 0.02106547 hartree
nonthermalcorr: 0.31046914 hartree
totalcorr: 0.33153461 hartree
totalenthalpy: -1406.00829170 hartree
