program: Orca
programVersion: 5.0.2
elementType: N H C H C O C C O N H C H H H O H H S H C O C H H C H H C H N H H C O O H H
charge: 1
multiplicity: 1
keywords: wB97X-D3BJ Opt Freq def2-TZVPP def2/J RIJCOSX VeryTightSCF
keywords: PAL8 defgrid3 TightOpt
frequency: 0.00 0.00 0.00 0.00 0.00 0.00 17.51 23.39 27.54 41.31 49.06 55.82 72.42 79.16 81.88 107.27 120.69 161.45 173.83 226.41 237.74 269.42 276.44 305.19 314.42 323.24 344.11 352.70 376.05 423.39 438.60 472.35 500.07 518.21 527.75 542.44 571.08 582.69 611.00 632.91 646.23 674.35 688.19 715.81 736.15 745.75 763.52 799.43 835.13 837.05 859.33 878.59 904.38 928.91 981.52 1021.33 1023.98 1053.19 1073.04 1079.85 1110.08 1129.65 1151.04 1163.24 1174.46 1199.47 1204.43 1208.90 1230.90 1259.65 1284.86 1305.78 1308.45 1326.81 1335.63 1343.75 1365.87 1371.38 1392.73 1397.81 1406.85 1431.32 1443.74 1462.09 1476.66 1480.23 1484.56 1535.38 1596.10 1605.56 1623.08 1679.47 1709.06 1780.40 1880.88 1888.75 2100.78 2758.17 3085.82 3094.28 3105.00 3109.79 3121.10 3125.68 3142.08 3151.78 3169.08 3175.37 3500.27 3551.65 3570.42 3639.41 3788.18 3798.87
frequency: 17.51 23.39 27.54 41.31 49.06 55.82 72.42 79.16 81.88 107.27 120.69 161.45 173.83 226.41 237.74 269.42 276.44 305.19 314.42 323.24 344.11 352.70 376.05 423.39 438.60 472.35 500.07 518.21 527.75 542.44 571.08 582.69 611.00 632.91 646.23 674.35 688.19 715.81 736.15 745.75 763.52 799.43 835.13 837.05 859.33 878.59 904.38 928.91 981.52 1021.33 1023.98 1053.19 1073.04 1079.85 1110.08 1129.65 1151.04 1163.24 1174.46 1199.47 1204.43 1208.90 1230.90 1259.65 1284.86 1305.78 1308.45 1326.81 1335.63 1343.75 1365.87 1371.38 1392.73 1397.81 1406.85 1431.32 1443.74 1462.09 1476.66 1480.23 1484.56 1535.38 1596.10 1605.56 1623.08 1679.47 1709.06 1780.40 1880.88 1888.75 2100.78 2758.17 3085.82 3094.28 3105.00 3109.79 3121.10 3125.68 3142.08 3151.78 3169.08 3175.37 3500.27 3551.65 3570.42 3639.41 3788.18 3798.87
formula: C10H18N3O6S
InChI: InChI=1S/C10H18N3O6S/c11-5(10(18)19)1-2-7(14)13-6(4-20)9(17)12-3-8(15)16/h5-6,12-13,15,18,20H,1-4H2,11H3
38 atoms
N  -3.091348 1.654401 0.7819
H  -2.816524 2.62018 0.699453
C  -4.48164 1.327741 1.004088
H  -4.561014 0.411324 1.586701
C  -5.312442 1.1184 -0.253358
O  -6.416487 0.659707 -0.237256
C  -2.240561 0.714746 0.333276
C  -0.841942 1.202384 -0.064222
O  -2.530089 -0.46643 0.225688
N  -0.018909 0.002966 -0.085031
H  -0.447632 1.898986 0.676628
C  -0.8415 1.876264 -1.446814
H  -0.554705 -0.85843 -0.100117
H  0.194896 2.029051 -1.745455
H  -1.313813 1.225797 -2.182353
O  -4.695157 1.530755 -1.384614
H  -5.310947 1.357889 -2.109821
H  -4.951589 2.128053 1.576169
S  -1.610967 3.511583 -1.48286
H  -2.862214 3.098508 -1.714342
C  1.300801 0.00671 -0.037481
O  1.940718 1.081483 0.03176
C  1.991391 -1.338772 -0.112857
H  1.298319 -2.114227 0.215523
H  2.190448 -1.543094 -1.168439
C  3.284241 -1.474028 0.703453
H  3.540859 -2.532776 0.731302
H  3.117029 -1.167212 1.739592
C  4.526137 -0.751159 0.174716
H  5.397521 -1.097152 0.736739
N  4.423025 0.729088 0.357964
H  3.359207 0.996672 0.176014
H  4.660263 0.995134 1.310305
C  4.822259 -1.098117 -1.282906
O  4.58871 -2.167164 -1.759838
O  5.411356 -0.077978 -1.930656
H  5.628065 -0.360915 -2.830654
H  5.043067 1.221437 -0.282863
totalener: -1406.25100347 hartree
nucrepener: 1757.34219639 hartree
electener: -3163.59319986 hartree
oneelecener: -5399.46965980 hartree
twoeener: 2235.87645995 hartree
kineticenergy: 1400.64330747 hartree
exchangeener: -105.321677929252 hartree
correlationener: -7.052077426810 hartree
xcener: -112.373755356062 hartree
temp: 298.15 k
press: 1.00 atm
thermalcorrenthalpy: 0.00094421 hartree
totalenthalpy: -1406.00016031 hartree
totalentropycorr: -0.06611252 hartree
gibbsenthalpy: -1406.06627283 hartree
gibbsminuselec: 0.26110620 hartree
chargesum: 1.0000000
charge: -0.208849 0.179318 -0.074340 0.140923 0.298144 -0.275958 0.273032 0.057410 -0.386957 -0.147904 0.121304 -0.188339 0.194729 0.126220 0.131406 -0.294336 0.234953 0.131611 -0.160534 0.128282 0.303637 -0.432747 -0.179566 0.129062 0.131343 -0.203846 0.149933 0.121550 -0.015517 0.154126 -0.087854 0.217147 0.213604 0.276616 -0.247479 -0.283159 0.255422 0.217616
charge: 0.331956 -0.037598 -0.034844 0.045651 -0.430176 0.141614 -0.382033 -0.119758 0.092224 0.377809 0.033600 -0.239842 -0.013398 0.008710 0.012348 0.342589 -0.085133 0.040212 0.499176 -0.150136 -0.326819 0.161644 0.002886 0.042715 0.043535 0.006476 0.049895 0.034440 -0.059080 0.049291 0.579917 -0.104552 0.032530 -0.433650 0.168881 0.364871 -0.066284 0.020333
qa: -0.2088 0.1793 -0.0743 0.1409 0.2981 -0.2760 0.2730 0.0574 -0.3870 -0.1479 0.1213 -0.1883 0.1947 0.1262 0.1314 -0.2943 0.2350 0.1316 -0.1605 0.1283 0.3036 -0.4327 -0.1796 0.1291 0.1313 -0.2038 0.1499 0.1215 -0.0155 0.1541 -0.0879 0.2171 0.2136 0.2766 -0.2475 -0.2832 0.2554 0.2176
va: 3.2026 1.0449 3.8302 1.0191 4.2693 2.2374 4.2346 3.7987 2.1349 3.3292 1.0300 3.9611 1.0436 1.0111 1.0096 2.1353 1.0201 1.0005 2.1696 1.0306 4.0948 2.0806 3.8358 1.0097 1.0165 3.9351 1.0049 1.0062 3.8616 0.9998 3.4924 1.1219 0.9862 4.3559 2.2539 2.1948 1.0063 1.0036
dispcorr: -0.077201351 hartree
energy: -1406.333314185109
dipole: 12.14700 -6.51869 5.62831 -2.31863 2.51513 0.19650 4.50446 -3.61520 0.88926
magnitude: 5.70151 au
magnitude: 14.49208 debye
zeropoint: 0.30946641 hartree
thermalvibcorrection: 0.01839436 hartree
thermalrotcorrection: 0.00141627 hartree
thermaltrasncorrection: 0.00141627 hartree
thermaltotal: -1406.00262087 hartree
thermalcorr: 0.02122690 hartree
nonthermalcorr: 0.30946641 hartree
totalcorr: 0.33069332 hartree
totalenthalpy: -1406.00167666 hartree
