program: Gaussian 09
title: 000048556
version: EM64L-G09RevD.01
frameworkgroup: C1[X(C11H16N2O4)]
method: RPBEPBE
basis: SDD
operation: Freq
keyword: #p
keyword: freq=noraman
keyword: PBEPBE/SDD
title: #p freq=noraman PBEPBE/SDD
converged: YES YES NO NO
title: Mulliken charges:
elementType: O O O O N N C C C C C C C C C C C H H H H H H H H H H H H H H H H
charge: -0.488084 -0.239702 -0.219792 -0.230967 -0.370852 -0.369873 0.092180 -0.502571 0.004221 -0.537424 0.188648 0.205725 -0.427974 -0.030310 0.152093 -0.695486 -0.598626 0.264328 0.244355 0.220666 0.228189 0.254274 0.227594 0.188326 0.357427 0.361726 0.261241 0.220829 0.234869 0.214854 0.348328 0.221333 0.220455
chargesum: 0.00000
title: Mulliken charges with hydrogens summed into heavy atoms:
elementType: O O O O N N C C C C C C C C C C C
charge: -0.139756 -0.239702 -0.219792 -0.230967 -0.013425 -0.008147 0.092180 0.006113 0.224887 -0.054960 0.188648 0.205725 -0.012054 0.230931 0.152093 -0.024934 -0.156838
polarizability: 1.68603565e+02 -2.52230856e+01 1.36207492e+02 -4.62663885e+00 8.03549860e-02 1.27302024e+02
1716.lowfreq: -4.7337 -0.0006 -0.0002 0.0004 3.4208 15.7545 35.9005 45.2981 58.6363
frequency: 35.7045 45.2244 58.6287 76.3865 80.3381 104.4958 136.9904 147.3211 157.6039 174.5993 183.4816 212.8971 229.2392 255.1803 282.7928 299.4313 317.9285 359.6468 370.9981 386.8109 420.5300 448.6302 479.1946 488.5280 514.7027 590.4384 617.9939 638.5846 651.2862 685.7433 732.3433 755.0199 757.7986 784.1322 789.3172 811.4935 874.5753 897.7336 925.4114 953.3438 956.9550 979.0536 994.1403 1002.8906 1011.7545 1035.3021 1058.1246 1088.8198 1092.5031 1132.9828 1159.5543 1199.4458 1216.6148 1234.7564 1259.9741 1286.8980 1297.6588 1306.7060 1309.8283 1316.5661 1333.4999 1354.7331 1373.7867 1376.7763 1377.6696 1390.6953 1397.9182 1428.7054 1453.2990 1459.5374 1469.4997 1480.7782 1488.4057 1612.6249 1649.3561 1656.1868 1675.8430 2963.7992 2966.2189 2969.8112 2982.9234 3012.5196 3033.8176 3048.2134 3077.7203 3083.0928 3086.4157 3086.9175 3119.3190 3196.7833 3522.5772 3527.1762 3572.7582
redmass: 5.4676 5.8114 3.0436 2.8951 3.5672 2.9119 3.2388 4.5506 5.7873 4.6295 2.9659 4.0635 1.3762 2.7326 1.6100 1.7656 3.6358 10.0215 2.9687 5.8770 2.7743 2.8973 3.2685 8.3049 3.5928 4.2053 2.3077 3.8182 2.3846 2.5739 3.1010 3.0837 2.0886 1.7703 1.8072 1.8962 1.9866 1.6649 2.4466 1.4827 1.8515 2.5059 2.9967 1.4612 1.6810 3.2757 2.6378 2.1413 1.5645 2.3908 2.8340 2.1585 1.5973 1.2811 1.4857 1.2947 1.2752 1.5804 1.2594 1.7275 1.7282 1.4269 2.8292 2.1584 2.4277 1.4307 1.2883 1.1807 1.0940 1.1039 1.0753 1.0487 1.0588 6.7916 7.8636 4.8530 5.3419 1.0647 1.0633 1.0832 1.0365 1.0614 1.0977 1.0974 1.0997 1.1010 1.0991 1.0616 1.0938 1.1142 1.0764 1.0773 1.0661
irintensity: 0.1947 0.5693 0.8029 0.0073 1.3710 0.4037 0.9072 2.6913 0.1847 9.1376 2.4503 1.8536 0.3286 13.7734 40.5525 69.1856 5.4751 28.8255 6.3355 2.9544 9.4474 4.2013 17.5432 17.5618 33.9766 1.2082 3.8275 2.1689 2.6540 38.0706 27.4992 4.7472 5.8789 17.4950 184.5527 5.0699 7.9260 3.3923 10.9746 82.8254 20.6809 49.9865 2.1322 20.3915 4.2809 6.5356 3.0761 5.9499 35.3660 5.2658 6.9461 14.0008 66.1217 3.8511 25.1898 1.7960 18.9970 74.7216 15.8997 132.2727 119.6071 33.6381 93.8805 11.6220 121.6034 5.2583 25.0279 3.8744 19.5380 16.7655 4.6185 10.6558 11.9743 301.6615 74.6273 5.8815 658.3906 44.8808 19.3925 15.8240 25.6552 8.6150 14.8714 6.5643 45.7112 30.8088 20.0884 9.3375 3.7757 20.1600 68.2567 56.6527 6.6998
temp: 298.150 k
press: 1.00000 atm
elementType: 8 8 8 8 7 7 6 6 6 6 6 6 6 6 6 6 6 1 1 1 1 1 1 1 1 1 1 1 1 1 1 1 1
symmnumber: 1
zpe: 693250.3 jmol-1
zpe.correction: 0.264045 hartree
zpe.thermalcorrener: 0.281874 hartree
zpe.thermalcorrenthalpy: 0.282818 hartree
zpe.thermalcorrgfe: 0.218054 hartree
zpe.sumelectzpe: -837.890796 hartree
zpe.sumelectthermal: -837.872967 hartree
zpe.sumelectthermalent: -837.872023 hartree
zpe.sumelectthermalfe: -837.936786 hartree
dipole: -2.5703 -0.3189 -0.6568
dipole: 2.6720
quadrupole: -106.2344 -93.1908 -108.5464
quadrupole: 6.0306 1.2298 4.4132
quadrupole: -3.5772 9.4664 -5.8892 6.0306 1.2298 4.4132
hfenergy: -838.1548407 hartree
pointgroup: C01 [X(C11H16N2O4)]
dipole: -1.0065947 -0.0036757 -0.3030934 debye
polarizability: 164.7529143|-26.7645287|140.3018883|-6.8294908|1.1765001|127.0582787 unknown
InChI: InChI=1S/C11H16N2O4/c1-3-5-11(6-7(14)4-2)8(15)12-10(17)13-9(11)16/h3,7,12-14H,1,4-6H2,2H3
charge 0 multiplicity 1
33 atoms
O  -0.563991 -2.074412 -0.447576
O  0.156211 0.90569 -2.110246
O  0.295324 -0.733259 2.454355
O  3.851788 -1.356613 -0.462878
N  2.021367 -0.107834 -1.205312
N  2.064802 -0.966434 0.992246
C  0.09247 0.439053 0.303315
C  -1.418428 0.076673 0.227469
C  -1.712628 -1.153224 -0.654052
C  0.271968 1.90316 0.905464
C  0.721886 0.418333 -1.094406
C  0.785314 -0.487515 1.323241
C  -3.044281 -1.845042 -0.303098
C  -0.439111 2.999075 0.140628
C  2.724236 -0.847956 -0.238733
C  -4.276912 -0.945962 -0.549097
C  -1.303528 3.87557 0.710803
H  -1.972375 0.944183 -0.167637
H  -1.754991 -0.108058 1.264599
H  -1.725918 -0.842241 -1.72036
H  1.359125 2.123704 0.950404
H  -0.097037 1.864807 1.946993
H  -3.006841 -2.169834 0.754584
H  -3.140926 -2.763245 -0.92056
H  2.463478 -0.055695 -2.128711
H  2.541224 -1.536404 1.698143
H  -0.211499 3.08084 -0.930775
H  -5.211289 -1.499049 -0.347053
H  -4.267369 -0.056144 0.105415
H  -4.312879 -0.594534 -1.597494
H  -0.713406 -2.908409 -0.958929
H  -1.77062 4.67741 0.128155
H  -1.563965 3.821862 1.775702
