program: Orca
programVersion: 5.0.2
elementType: N H C H C O C C O N H C H H H O H H S H C O C H H C H H C H N H H C O O H H
charge: 1
multiplicity: 1
keywords: wB97X-D3BJ Opt Freq def2-TZVPP def2/J RIJCOSX VeryTightSCF
keywords: PAL8 defgrid3 TightOpt
frequency: 0.00 0.00 0.00 0.00 0.00 0.00 21.61 31.97 35.31 46.91 59.48 61.34 72.49 88.16 101.57 105.05 121.70 146.02 181.62 213.08 235.03 251.32 270.14 293.35 301.39 304.75 329.79 348.87 366.36 394.14 418.34 444.44 473.37 491.81 506.65 510.09 516.63 552.10 581.19 636.41 652.66 658.21 667.44 725.14 741.10 756.98 772.53 805.24 839.37 852.25 871.86 885.22 905.43 952.39 972.56 990.72 1024.08 1043.74 1061.58 1098.51 1120.76 1129.19 1154.51 1163.10 1186.25 1198.26 1201.47 1211.65 1236.25 1261.60 1291.65 1306.37 1320.82 1328.91 1341.96 1343.67 1365.43 1378.57 1398.98 1407.84 1414.48 1449.56 1460.14 1470.75 1486.46 1498.91 1503.60 1571.48 1591.11 1604.03 1642.62 1677.40 1723.14 1782.77 1832.51 1855.31 2723.71 2747.56 3087.28 3097.41 3098.73 3104.43 3107.21 3110.62 3151.22 3156.98 3157.45 3158.55 3391.42 3495.44 3666.69 3694.96 3787.93 3812.20
frequency: 21.61 31.97 35.31 46.91 59.48 61.34 72.49 88.16 101.57 105.05 121.70 146.02 181.62 213.08 235.03 251.32 270.14 293.35 301.39 304.75 329.79 348.87 366.36 394.14 418.34 444.44 473.37 491.81 506.65 510.09 516.63 552.10 581.19 636.41 652.66 658.21 667.44 725.14 741.10 756.98 772.53 805.24 839.37 852.25 871.86 885.22 905.43 952.39 972.56 990.72 1024.08 1043.74 1061.58 1098.51 1120.76 1129.19 1154.51 1163.10 1186.25 1198.26 1201.47 1211.65 1236.25 1261.60 1291.65 1306.37 1320.82 1328.91 1341.96 1343.67 1365.43 1378.57 1398.98 1407.84 1414.48 1449.56 1460.14 1470.75 1486.46 1498.91 1503.60 1571.48 1591.11 1604.03 1642.62 1677.40 1723.14 1782.77 1832.51 1855.31 2723.71 2747.56 3087.28 3097.41 3098.73 3104.43 3107.21 3110.62 3151.22 3156.98 3157.45 3158.55 3391.42 3495.44 3666.69 3694.96 3787.93 3812.20
formula: C10H18N3O6S
InChI: InChI=1S/C10H18N3O6S/c11-5(10(18)19)1-2-7(14)13-6(4-20)9(17)12-3-8(15)16/h5-6,12-13,15,18,20H,1-4H2,11H3
38 atoms
N  -0.009931 2.803624 1.682606
H  0.148326 3.442693 0.924179
C  0.210499 3.234003 3.037946
H  0.226693 4.32402 3.078738
C  1.503184 2.729645 3.656143
O  2.41748 2.198472 3.070518
C  -0.219272 1.49314 1.422183
C  -0.590188 1.12498 -0.026803
O  -0.188638 0.64135 2.29072
N  0.150571 -0.069081 -0.38255
H  -0.328249 1.933141 -0.713179
C  -2.096853 0.858373 -0.067768
H  -0.356789 -0.926374 -0.52534
H  -2.356916 0.15726 0.72768
H  -2.631139 1.787586 0.126191
O  1.513327 2.980226 4.96236
H  2.352706 2.682422 5.33688
H  -0.604022 2.896172 3.680596
S  -2.682762 0.092644 -1.593866
H  -2.312071 1.072616 -2.427574
C  1.480032 -0.062027 -0.305739
O  2.093968 1.008219 -0.180308
C  2.199883 -1.387649 -0.234173
H  1.536565 -2.203935 -0.519742
H  3.032561 -1.377799 -0.940827
C  2.684712 -1.616734 1.214872
H  2.804195 -2.686318 1.382445
H  1.923673 -1.267098 1.91801
C  4.028274 -0.975161 1.577784
H  4.281933 -1.259253 2.601909
N  4.012945 0.511159 1.500506
H  3.387294 0.817363 0.696384
H  3.601972 0.959997 2.326281
C  5.187224 -1.434669 0.697471
O  5.984734 -0.671551 0.221496
O  5.211665 -2.756853 0.557482
H  5.988042 -2.999544 0.032552
H  4.962753 0.84822 1.335797
totalener: -1406.26276074 hartree
nucrepener: 1835.74381615 hartree
electener: -3242.00657689 hartree
oneelecener: -5555.38894143 hartree
twoeener: 2313.38236454 hartree
kineticenergy: 1400.67610804 hartree
exchangeener: -105.334728168517 hartree
correlationener: -7.054627658771 hartree
xcener: -112.389355827288 hartree
temp: 298.15 k
press: 1.00 atm
thermalcorrenthalpy: 0.00094421 hartree
totalenthalpy: -1406.01173927 hartree
totalentropycorr: -0.06582104 hartree
gibbsenthalpy: -1406.07756031 hartree
gibbsminuselec: 0.26331786 hartree
chargesum: 1.0000000
charge: -0.177568 0.184195 -0.094219 0.144768 0.363011 -0.402314 0.224348 0.058406 -0.385758 -0.138103 0.113110 -0.181398 0.176146 0.146483 0.123003 -0.233583 0.235079 0.146019 -0.126485 0.102011 0.260123 -0.415460 -0.170397 0.116073 0.118015 -0.167310 0.139631 0.132029 0.006962 0.144750 -0.076408 0.213704 0.227507 0.271527 -0.293373 -0.251560 0.253554 0.213484
charge: 0.336228 -0.018417 -0.039143 0.042870 -0.407405 0.096044 -0.386825 -0.133815 0.089635 0.364161 0.029929 -0.242848 -0.017197 0.020353 0.012129 0.397613 -0.079722 0.046495 0.494435 -0.145871 -0.347314 0.134644 0.005903 0.035393 0.037744 0.008524 0.041019 0.039190 -0.059388 0.047565 0.603082 -0.054933 -0.005006 -0.439271 0.137017 0.395746 -0.066679 0.028114
qa: -0.1776 0.1842 -0.0942 0.1448 0.3630 -0.4023 0.2243 0.0584 -0.3858 -0.1381 0.1131 -0.1814 0.1761 0.1465 0.1230 -0.2336 0.2351 0.1460 -0.1265 0.1020 0.2601 -0.4155 -0.1704 0.1161 0.1180 -0.1673 0.1396 0.1320 0.0070 0.1448 -0.0764 0.2137 0.2275 0.2715 -0.2934 -0.2516 0.2536 0.2135
va: 3.1823 1.0117 3.8490 1.0034 4.1969 2.0803 4.1888 3.9015 2.1410 3.2838 1.0120 3.9475 1.0355 1.0062 1.0082 2.2581 1.0227 1.0132 2.1722 1.0242 4.1692 2.1026 3.8866 1.0097 1.0210 3.8458 1.0105 1.0235 3.9144 1.0017 3.5671 1.1103 1.0342 4.3568 2.1971 2.2523 1.0060 1.0082
dispcorr: -0.079469054 hartree
energy: -1406.349102713489
dipole: 0.03203 1.53224 1.56427 -0.97189 0.95498 -0.01691 0.81963 -0.18461 0.63502
magnitude: 1.68834 au
magnitude: 4.29141 debye
zeropoint: 0.31040198 hartree
thermalvibcorrection: 0.01860570 hartree
thermalrotcorrection: 0.00141627 hartree
thermaltrasncorrection: 0.00141627 hartree
thermaltotal: -1406.01726250 hartree
thermalcorr: 0.02143824 hartree
nonthermalcorr: 0.31040198 hartree
totalcorr: 0.33184021 hartree
totalenthalpy: -1406.01631829 hartree
