program: Orca
programVersion: 5.0.2
elementType: N H C H C O C C O N H C H H H O H H S H C O C H H C H H C H N H H C O O H H
charge: 1
multiplicity: 1
keywords: wB97X-D3BJ Opt Freq def2-TZVPP def2/J RIJCOSX VeryTightSCF
keywords: PAL8 defgrid3 TightOpt
frequency: 0.00 0.00 0.00 0.00 0.00 0.00 17.03 24.31 31.28 45.69 60.77 66.47 71.69 84.48 94.85 110.58 123.98 150.95 167.07 225.31 241.41 271.73 285.68 300.82 313.94 323.71 341.37 374.91 383.88 415.94 435.96 476.60 494.88 509.33 515.00 558.54 592.94 611.51 621.90 657.64 658.54 672.82 691.75 714.73 736.31 749.35 761.42 803.97 839.24 847.61 876.76 884.93 909.50 943.09 984.83 1026.56 1029.47 1060.19 1076.22 1081.44 1112.50 1131.47 1160.55 1167.60 1192.29 1196.35 1209.04 1210.07 1226.49 1258.85 1284.68 1299.41 1304.98 1319.07 1334.34 1338.43 1356.23 1364.81 1392.75 1409.42 1437.04 1449.23 1460.08 1463.58 1476.28 1477.25 1495.60 1570.60 1591.08 1598.74 1612.86 1681.41 1717.14 1781.17 1844.65 1853.74 2157.60 2738.20 3076.89 3095.64 3110.22 3119.55 3119.84 3125.76 3139.42 3153.21 3170.29 3172.97 3422.88 3554.47 3571.18 3614.84 3783.76 3803.97
frequency: 17.03 24.31 31.28 45.69 60.77 66.47 71.69 84.48 94.85 110.58 123.98 150.95 167.07 225.31 241.41 271.73 285.68 300.82 313.94 323.71 341.37 374.91 383.88 415.94 435.96 476.60 494.88 509.33 515.00 558.54 592.94 611.51 621.90 657.64 658.54 672.82 691.75 714.73 736.31 749.35 761.42 803.97 839.24 847.61 876.76 884.93 909.50 943.09 984.83 1026.56 1029.47 1060.19 1076.22 1081.44 1112.50 1131.47 1160.55 1167.60 1192.29 1196.35 1209.04 1210.07 1226.49 1258.85 1284.68 1299.41 1304.98 1319.07 1334.34 1338.43 1356.23 1364.81 1392.75 1409.42 1437.04 1449.23 1460.08 1463.58 1476.28 1477.25 1495.60 1570.60 1591.08 1598.74 1612.86 1681.41 1717.14 1781.17 1844.65 1853.74 2157.60 2738.20 3076.89 3095.64 3110.22 3119.55 3119.84 3125.76 3139.42 3153.21 3170.29 3172.97 3422.88 3554.47 3571.18 3614.84 3783.76 3803.97
formula: C10H18N3O6S
InChI: InChI=1S/C10H18N3O6S/c11-5(10(18)19)1-2-7(14)13-6(4-20)9(17)12-3-8(15)16/h5-6,12-13,15,18,20H,1-4H2,11H3
38 atoms
N  -3.109159 1.636961 0.73102
H  -2.834484 2.598918 0.598546
C  -4.517373 1.330163 0.789221
H  -4.669053 0.364755 1.27024
C  -5.134252 1.282645 -0.600452
O  -4.559692 1.575492 -1.61702
C  -2.247203 0.693678 0.301262
C  -0.844954 1.185495 -0.0715
O  -2.529806 -0.488983 0.195127
N  -0.015485 -0.009994 -0.074659
H  -0.46661 1.88779 0.672349
C  -0.829023 1.851294 -1.459241
H  -0.546589 -0.873996 -0.090912
H  0.210959 1.999756 -1.746833
H  -1.29711 1.196468 -2.193609
O  -6.407932 0.886343 -0.547428
H  -6.761631 0.882718 -1.447156
H  -5.0394 2.083567 1.379729
S  -1.606277 3.482067 -1.516883
H  -2.838555 3.051855 -1.818481
C  1.304042 0.003457 -0.028575
O  1.943723 1.075051 0.041829
C  2.007443 -1.338765 -0.091741
H  1.324022 -2.11911 0.244445
H  2.206774 -1.547362 -1.148069
C  3.2978 -1.419578 0.737072
H  3.529502 -2.470818 0.906816
H  3.144481 -0.971144 1.721468
C  4.549969 -0.799961 0.105179
H  5.415895 -1.050821 0.720885
N  4.456633 0.684362 -0.008856
H  4.870486 0.967033 -0.902698
H  3.386355 0.956564 -0.000987
C  4.8346 -1.319431 -1.301073
O  5.011006 -0.588151 -2.239197
O  4.869846 -2.64583 -1.338156
H  5.088655 -2.931532 -2.237254
H  4.932185 1.158633 0.75302
totalener: -1406.26203115 hartree
nucrepener: 1758.15933361 hartree
electener: -3164.42136476 hartree
oneelecener: -5401.60860326 hartree
twoeener: 2237.18723849 hartree
kineticenergy: 1400.66055316 hartree
exchangeener: -105.328303793015 hartree
correlationener: -7.054082967307 hartree
xcener: -112.382386760322 hartree
temp: 298.15 k
press: 1.00 atm
thermalcorrenthalpy: 0.00094421 hartree
totalenthalpy: -1406.01121455 hartree
totalentropycorr: -0.06581982 hartree
gibbsenthalpy: -1406.07703437 hartree
gibbsminuselec: 0.26184258 hartree
chargesum: 1.0000000
charge: -0.205749 0.173041 -0.069536 0.138338 0.319957 -0.346317 0.268319 0.058936 -0.390948 -0.149299 0.123941 -0.185410 0.191245 0.125462 0.134437 -0.257059 0.240889 0.141054 -0.177693 0.148636 0.287795 -0.425129 -0.167768 0.131922 0.118124 -0.204194 0.146546 0.134714 -0.017098 0.151936 -0.084334 0.216167 0.215014 0.279140 -0.290608 -0.248740 0.257618 0.216647
charge: 0.331930 -0.038475 -0.039367 0.042931 -0.433546 0.106660 -0.375575 -0.118733 0.090512 0.377184 0.034164 -0.239216 -0.014946 0.007404 0.013951 0.380498 -0.079669 0.038194 0.496982 -0.145728 -0.332562 0.158789 0.002235 0.041513 0.041084 0.003563 0.044765 0.036587 -0.059266 0.046734 0.587234 0.022732 -0.097039 -0.440945 0.141820 0.401149 -0.063633 0.030085
qa: -0.2057 0.1730 -0.0695 0.1383 0.3200 -0.3463 0.2683 0.0589 -0.3909 -0.1493 0.1239 -0.1854 0.1912 0.1255 0.1344 -0.2571 0.2409 0.1411 -0.1777 0.1486 0.2878 -0.4251 -0.1678 0.1319 0.1181 -0.2042 0.1465 0.1347 -0.0171 0.1519 -0.0843 0.2162 0.2150 0.2791 -0.2906 -0.2487 0.2576 0.2166
va: 3.2310 1.0568 3.8277 1.0204 4.2538 2.1217 4.2466 3.7984 2.1297 3.3322 1.0276 3.9665 1.0460 1.0100 1.0093 2.2374 1.0162 1.0038 2.1693 1.0278 4.1212 2.0886 3.8377 1.0063 1.0123 3.8849 1.0089 1.0040 3.9338 1.0014 3.5128 1.0169 1.1232 4.3455 2.1980 2.2641 1.0028 0.9850
dispcorr: -0.077716312 hartree
energy: -1406.344841914662
dipole: 10.23193 -5.92863 4.30329 -4.24546 2.90830 -1.33715 5.12926 -3.82749 1.30177
magnitude: 4.69051 au
magnitude: 11.92234 debye
zeropoint: 0.30997052 hartree
thermalvibcorrection: 0.01821140 hartree
thermalrotcorrection: 0.00141627 hartree
thermaltrasncorrection: 0.00141627 hartree
thermaltotal: -1406.01382746 hartree
thermalcorr: 0.02104394 hartree
nonthermalcorr: 0.30997052 hartree
totalcorr: 0.33101446 hartree
totalenthalpy: -1406.01288325 hartree
