program: Orca
programVersion: 5.0.2
elementType: N H C H C O C C O N H C H H H O H H S H C O C H H C H H C H N H H C O O H H
charge: 1
multiplicity: 1
keywords: wB97X-D3BJ Opt Freq def2-TZVPP def2/J RIJCOSX VeryTightSCF
keywords: PAL8 defgrid3 TightOpt
frequency: 0.00 0.00 0.00 0.00 0.00 0.00 19.31 24.01 34.87 45.84 65.89 68.19 77.61 92.03 100.07 105.53 166.67 190.75 203.48 207.07 230.78 254.04 285.74 299.03 301.08 317.98 343.92 358.00 384.27 393.20 435.43 464.46 506.14 514.48 518.70 531.14 551.82 584.67 602.34 644.18 653.19 663.18 669.08 686.25 705.70 725.35 736.81 802.94 811.94 862.15 880.25 890.60 910.75 946.19 972.33 1024.07 1040.98 1044.62 1061.08 1079.08 1112.47 1120.56 1139.71 1167.38 1182.96 1195.11 1212.77 1240.70 1258.33 1270.16 1283.79 1293.81 1308.27 1314.11 1319.18 1336.98 1347.21 1376.07 1395.27 1418.58 1433.25 1447.36 1454.81 1465.89 1476.73 1483.83 1496.01 1554.46 1582.15 1596.42 1629.83 1666.61 1727.13 1760.97 1849.57 1855.69 2725.02 3085.13 3093.58 3101.99 3110.76 3115.61 3121.20 3133.54 3141.24 3161.09 3164.36 3172.63 3339.45 3418.50 3608.82 3685.07 3786.91 3800.46
frequency: 19.31 24.01 34.87 45.84 65.89 68.19 77.61 92.03 100.07 105.53 166.67 190.75 203.48 207.07 230.78 254.04 285.74 299.03 301.08 317.98 343.92 358.00 384.27 393.20 435.43 464.46 506.14 514.48 518.70 531.14 551.82 584.67 602.34 644.18 653.19 663.18 669.08 686.25 705.70 725.35 736.81 802.94 811.94 862.15 880.25 890.60 910.75 946.19 972.33 1024.07 1040.98 1044.62 1061.08 1079.08 1112.47 1120.56 1139.71 1167.38 1182.96 1195.11 1212.77 1240.70 1258.33 1270.16 1283.79 1293.81 1308.27 1314.11 1319.18 1336.98 1347.21 1376.07 1395.27 1418.58 1433.25 1447.36 1454.81 1465.89 1476.73 1483.83 1496.01 1554.46 1582.15 1596.42 1629.83 1666.61 1727.13 1760.97 1849.57 1855.69 2725.02 3085.13 3093.58 3101.99 3110.76 3115.61 3121.20 3133.54 3141.24 3161.09 3164.36 3172.63 3339.45 3418.50 3608.82 3685.07 3786.91 3800.46
formula: C10H18N3O6S
InChI: InChI=1S/C10H18N3O6S/c11-5(10(18)19)1-2-7(14)13-6(4-20)9(17)12-3-8(15)16/h5-6,12-13,15,18,20H,1-4H2,11H3
38 atoms
N  -1.667922 2.492978 2.007352
H  -2.248164 2.926808 1.310899
C  -1.930165 2.790949 3.394543
H  -1.00333 2.779578 3.966783
C  -2.892624 1.785067 4.010322
O  -3.427403 0.891326 3.411265
C  -0.89434 1.455039 1.653516
C  -0.87185 1.125886 0.149117
O  -0.245636 0.82095 2.483486
N  0.013331 0.018261 -0.104659
H  -0.485578 2.0074 -0.369044
C  -2.269354 0.788814 -0.388543
H  -0.411726 -0.896341 -0.0536
H  -2.96591 1.609225 -0.224939
H  -2.197754 0.642408 -1.46637
O  -3.069206 2.037908 5.308924
H  -3.699173 1.395376 5.663223
H  -2.359835 3.788877 3.481761
S  -2.954989 -0.745952 0.27829
H  -3.154997 -0.300867 1.528031
C  1.345652 0.138458 0.023547
O  1.896081 1.226617 0.182233
C  2.140222 -1.154929 -0.007262
H  1.492601 -2.009451 0.202191
H  2.522422 -1.283301 -1.022776
C  3.321304 -1.127721 0.964244
H  4.023109 -0.34013 0.679492
H  3.854631 -2.075143 0.896935
C  2.914326 -0.931741 2.42815
H  2.098028 -1.609988 2.688732
N  2.455665 0.465121 2.708869
H  2.918636 0.781244 3.568076
H  2.693607 1.076898 1.916393
C  4.057908 -1.197027 3.405339
O  4.4075 -0.387309 4.22424
O  4.576813 -2.406559 3.248009
H  5.280911 -2.535403 3.900015
H  1.420455 0.536628 2.777686
totalener: -1406.26513034 hartree
nucrepener: 1834.19610492 hartree
electener: -3240.46123525 hartree
oneelecener: -5552.54096021 hartree
twoeener: 2312.07972496 hartree
kineticenergy: 1400.68701421 hartree
exchangeener: -105.336221531342 hartree
correlationener: -7.056522885219 hartree
xcener: -112.392744416560 hartree
temp: 298.15 k
press: 1.00 atm
thermalcorrenthalpy: 0.00094421 hartree
totalenthalpy: -1406.01526802 hartree
totalentropycorr: -0.06534667 hartree
gibbsenthalpy: -1406.08061469 hartree
gibbsminuselec: 0.26414953 hartree
chargesum: 1.0000000
charge: -0.173143 0.185904 -0.079828 0.123941 0.323133 -0.330522 0.255544 0.082303 -0.461797 -0.156106 0.146487 -0.158615 0.163783 0.108075 0.143944 -0.256501 0.245945 0.148348 -0.154721 0.147269 0.184974 -0.414371 -0.152096 0.105081 0.132698 -0.210463 0.128877 0.133218 0.015092 0.140453 -0.061798 0.218510 0.225825 0.304285 -0.300620 -0.244522 0.255062 0.236354
charge: 0.350685 -0.013545 -0.034992 0.037903 -0.436230 0.116111 -0.348400 -0.133680 0.098687 0.345301 0.045728 -0.237896 -0.033683 0.002765 0.019498 0.381342 -0.076307 0.041071 0.501686 -0.144749 -0.378815 0.072428 -0.001569 0.030920 0.046570 0.000695 0.037024 0.040539 -0.045060 0.047561 0.609919 0.021913 0.015716 -0.428568 0.139025 0.401746 -0.063502 -0.027837
qa: -0.1731 0.1859 -0.0798 0.1239 0.3231 -0.3305 0.2555 0.0823 -0.4618 -0.1561 0.1465 -0.1586 0.1638 0.1081 0.1439 -0.2565 0.2459 0.1483 -0.1547 0.1473 0.1850 -0.4144 -0.1521 0.1051 0.1327 -0.2105 0.1289 0.1332 0.0151 0.1405 -0.0618 0.2185 0.2258 0.3043 -0.3006 -0.2445 0.2551 0.2364
va: 3.2394 1.0138 3.8209 1.0240 4.2514 2.1372 4.1700 3.8141 2.0310 3.2124 1.0112 3.9671 1.0648 1.0131 1.0024 2.2343 1.0121 1.0032 2.1771 1.0314 4.2647 2.0804 3.8402 1.0163 1.0062 3.8904 1.0098 1.0233 3.8553 1.0101 3.5812 1.0166 1.0266 4.3292 2.1907 2.2669 1.0048 1.0599
dispcorr: -0.080287256 hartree
energy: -1406.350986117033
dipole: 4.71732 -3.34597 1.37135 0.47606 -0.46297 0.01308 -4.68803 5.03394 0.34591
magnitude: 1.41436 au
magnitude: 3.59502 debye
zeropoint: 0.31126315 hartree
thermalvibcorrection: 0.01821770 hartree
thermalrotcorrection: 0.00141627 hartree
thermaltrasncorrection: 0.00141627 hartree
thermaltotal: -1406.01867272 hartree
thermalcorr: 0.02105025 hartree
nonthermalcorr: 0.31126315 hartree
totalcorr: 0.33231340 hartree
totalenthalpy: -1406.01772851 hartree
