program: Orca
programVersion: 5.0.2
elementType: N H C H C O C C O N H C H H H O H H S H C O C H H C H H C H N H H C O O H H
charge: 1
multiplicity: 1
keywords: wB97X-D3BJ Opt Freq def2-TZVPP def2/J RIJCOSX VeryTightSCF
keywords: PAL8 defgrid3 TightOpt
frequency: 0.00 0.00 0.00 0.00 0.00 0.00 16.91 27.73 50.95 60.11 66.40 70.44 87.53 110.82 119.13 131.29 140.32 183.91 189.22 221.73 242.13 258.79 290.18 307.50 316.38 325.59 339.53 356.24 383.24 433.77 448.92 479.90 509.17 523.35 536.08 546.92 549.37 577.26 585.51 604.07 628.43 651.56 704.70 721.56 735.00 762.27 797.01 810.90 834.18 864.79 878.24 902.27 908.76 933.90 960.87 987.78 1016.89 1033.15 1060.13 1068.10 1092.01 1136.68 1142.10 1156.86 1181.09 1212.01 1230.79 1244.50 1245.97 1274.28 1297.57 1308.85 1324.28 1338.25 1351.75 1368.73 1377.02 1381.91 1393.30 1403.31 1430.46 1444.17 1461.88 1473.87 1488.37 1490.70 1496.84 1502.81 1575.78 1608.57 1611.30 1711.01 1726.64 1790.46 1821.41 1882.70 2715.40 2747.09 3072.79 3093.01 3099.02 3106.00 3111.98 3119.86 3140.13 3154.61 3155.39 3169.04 3366.99 3502.69 3577.03 3605.28 3686.06 3808.64
frequency: 16.91 27.73 50.95 60.11 66.40 70.44 87.53 110.82 119.13 131.29 140.32 183.91 189.22 221.73 242.13 258.79 290.18 307.50 316.38 325.59 339.53 356.24 383.24 433.77 448.92 479.90 509.17 523.35 536.08 546.92 549.37 577.26 585.51 604.07 628.43 651.56 704.70 721.56 735.00 762.27 797.01 810.90 834.18 864.79 878.24 902.27 908.76 933.90 960.87 987.78 1016.89 1033.15 1060.13 1068.10 1092.01 1136.68 1142.10 1156.86 1181.09 1212.01 1230.79 1244.50 1245.97 1274.28 1297.57 1308.85 1324.28 1338.25 1351.75 1368.73 1377.02 1381.91 1393.30 1403.31 1430.46 1444.17 1461.88 1473.87 1488.37 1490.70 1496.84 1502.81 1575.78 1608.57 1611.30 1711.01 1726.64 1790.46 1821.41 1882.70 2715.40 2747.09 3072.79 3093.01 3099.02 3106.00 3111.98 3119.86 3140.13 3154.61 3155.39 3169.04 3366.99 3502.69 3577.03 3605.28 3686.06 3808.64
formula: C10H18N3O6S
InChI: InChI=1S/C10H18N3O6S/c11-5(10(18)19)1-2-7(14)13-6(4-20)9(17)12-3-8(15)16/h5-6,12-13,15,18,20H,1-4H2,11H3
38 atoms
N  -0.370311 2.988834 -1.841085
H  -0.147847 3.619952 -1.085675
C  -0.210211 3.423408 -3.2078
H  -0.982858 2.981856 -3.835428
C  1.144086 3.061857 -3.791004
O  2.1693 3.034467 -3.147218
C  -0.345786 1.65514 -1.600903
C  -0.712587 1.17411 -0.182665
O  -0.178036 0.832166 -2.476981
N  0.097857 0.008658 0.164572
H  -1.718025 0.770694 -0.3304
C  -0.874392 2.204195 0.937134
H  -0.360167 -0.885821 0.160844
H  -1.712516 2.845212 0.664812
H  -1.146035 1.668187 1.845901
O  1.079514 2.839308 -5.095817
H  1.963876 2.635173 -5.427906
H  -0.310942 4.509083 -3.253546
S  0.565366 3.270202 1.270371
H  -0.12744 4.155413 1.997924
C  1.431282 0.021497 0.164549
O  2.06835 1.073866 0.021719
C  2.157659 -1.285699 0.410202
H  2.641382 -1.179556 1.386711
H  1.454617 -2.11239 0.51258
C  3.191948 -1.673738 -0.665418
H  2.678269 -2.014908 -1.564397
H  3.760495 -2.521356 -0.279013
C  4.163806 -0.588168 -1.138604
H  5.073506 -1.055737 -1.520634
N  4.555363 0.347809 -0.033898
H  3.636924 0.827241 0.224301
H  4.971702 -0.132703 0.759252
C  3.582843 0.261782 -2.279348
O  2.807649 -0.180023 -3.074767
O  4.088976 1.491149 -2.261688
H  3.516484 2.088653 -2.801947
H  5.194539 1.059326 -0.38488
totalener: -1406.23547788 hartree
nucrepener: 1993.34475716 hartree
electener: -3399.58023504 hartree
oneelecener: -5871.02500824 hartree
twoeener: 2471.44477320 hartree
kineticenergy: 1400.65353056 hartree
exchangeener: -105.330209386264 hartree
correlationener: -7.063169826078 hartree
xcener: -112.393379212342 hartree
temp: 298.15 k
press: 1.00 atm
thermalcorrenthalpy: 0.00094421 hartree
totalenthalpy: -1405.99227907 hartree
totalentropycorr: -0.06345761 hartree
gibbsenthalpy: -1406.05573668 hartree
gibbsminuselec: 0.26368463 hartree
chargesum: 1.0000000
charge: -0.186184 0.178003 -0.076007 0.138817 0.380970 -0.394045 0.250386 -0.008296 -0.348125 -0.145170 0.123629 -0.184684 0.187220 0.145971 0.123404 -0.231423 0.235694 0.130108 -0.154118 0.121592 0.383253 -0.447293 -0.243385 0.125831 0.106096 -0.190423 0.140252 0.136655 -0.025182 0.154155 -0.065532 0.232109 0.212684 0.300453 -0.263846 -0.337038 0.261152 0.232317
charge: 0.326084 -0.051359 -0.036504 0.041811 -0.406099 0.144318 -0.388748 -0.119726 0.110916 0.366278 0.052893 -0.229361 -0.007760 0.011896 0.007348 0.404768 -0.077533 0.040381 0.480783 -0.146200 -0.345345 0.143969 -0.001653 0.034311 0.036844 0.007900 0.045637 0.032328 -0.049527 0.043431 0.596454 -0.042923 0.033315 -0.462451 0.160005 0.355970 -0.149923 0.037471
qa: -0.1862 0.1780 -0.0760 0.1388 0.3810 -0.3940 0.2504 -0.0083 -0.3481 -0.1452 0.1236 -0.1847 0.1872 0.1460 0.1234 -0.2314 0.2357 0.1301 -0.1541 0.1216 0.3833 -0.4473 -0.2434 0.1258 0.1061 -0.1904 0.1403 0.1367 -0.0252 0.1542 -0.0655 0.2321 0.2127 0.3005 -0.2638 -0.3370 0.2612 0.2323
va: 3.1436 1.0609 3.8848 1.0163 4.1725 2.1244 4.2171 3.9159 2.1846 3.2932 0.9987 3.9673 1.0095 0.9989 1.0074 2.2761 1.0230 1.0008 2.1760 1.0138 3.9993 2.0451 3.9001 1.0036 1.0224 3.8425 1.0254 0.9979 3.8416 0.9984 3.5661 1.0820 0.9836 4.3633 2.2380 2.1641 1.0772 0.9896
dispcorr: -0.082963419 hartree
energy: -1406.330934750561
dipole: 1.41019 0.27629 1.68647 -6.51041 5.24179 -1.26862 8.99610 -6.68839 2.30771
magnitude: 3.12716 au
magnitude: 7.94860 debye
zeropoint: 0.31110687 hartree
thermalvibcorrection: 0.01788967 hartree
thermalrotcorrection: 0.00141627 hartree
thermaltrasncorrection: 0.00141627 hartree
thermaltotal: -1405.99910567 hartree
thermalcorr: 0.02072221 hartree
nonthermalcorr: 0.31110687 hartree
totalcorr: 0.33182908 hartree
totalenthalpy: -1405.99816146 hartree
