program: Orca
programVersion: 5.0.2
elementType: N H C H C O C C O N H C H H H O H H S H C O C H H C H H C H N H H C O O H H
charge: 1
multiplicity: 1
keywords: wB97X-D3BJ Opt Freq def2-TZVPP def2/J RIJCOSX VeryTightSCF
keywords: PAL8 defgrid3 TightOpt
frequency: 0.00 0.00 0.00 0.00 0.00 0.00 9.24 14.93 20.86 38.71 46.40 55.72 63.81 73.26 86.59 107.60 119.33 153.41 172.36 189.11 212.25 243.27 262.73 281.76 287.17 307.51 315.03 340.73 412.34 421.30 439.53 463.29 487.27 505.33 516.98 571.73 581.28 597.51 602.68 616.21 645.95 658.53 675.76 706.05 729.94 739.69 756.33 809.75 821.17 847.89 880.41 896.72 942.02 967.99 984.71 1005.70 1023.72 1027.77 1057.08 1077.65 1125.65 1140.00 1164.57 1182.52 1192.37 1205.93 1209.67 1226.81 1235.31 1262.76 1264.12 1273.89 1293.15 1311.63 1319.22 1335.16 1357.57 1360.92 1379.64 1410.05 1424.75 1446.03 1459.66 1476.00 1480.11 1495.44 1506.31 1570.99 1584.39 1597.05 1615.72 1681.63 1718.80 1774.58 1854.06 1879.89 2189.89 2750.05 3070.66 3076.66 3094.33 3094.80 3108.03 3118.75 3119.18 3138.46 3152.49 3173.31 3418.94 3557.05 3571.21 3609.62 3783.74 3852.15
frequency: 9.24 14.93 20.86 38.71 46.40 55.72 63.81 73.26 86.59 107.60 119.33 153.41 172.36 189.11 212.25 243.27 262.73 281.76 287.17 307.51 315.03 340.73 412.34 421.30 439.53 463.29 487.27 505.33 516.98 571.73 581.28 597.51 602.68 616.21 645.95 658.53 675.76 706.05 729.94 739.69 756.33 809.75 821.17 847.89 880.41 896.72 942.02 967.99 984.71 1005.70 1023.72 1027.77 1057.08 1077.65 1125.65 1140.00 1164.57 1182.52 1192.37 1205.93 1209.67 1226.81 1235.31 1262.76 1264.12 1273.89 1293.15 1311.63 1319.22 1335.16 1357.57 1360.92 1379.64 1410.05 1424.75 1446.03 1459.66 1476.00 1480.11 1495.44 1506.31 1570.99 1584.39 1597.05 1615.72 1681.63 1718.80 1774.58 1854.06 1879.89 2189.89 2750.05 3070.66 3076.66 3094.33 3094.80 3108.03 3118.75 3119.18 3138.46 3152.49 3173.31 3418.94 3557.05 3571.21 3609.62 3783.74 3852.15
formula: C10H18N3O6S
InChI: InChI=1S/C10H18N3O6S/c11-5(10(18)19)1-2-7(14)13-6(4-20)9(17)12-3-8(15)16/h5-6,12-13,15,18,20H,1-4H2,11H3
38 atoms
N  -3.242316 1.506683 -0.206936
H  -3.038224 2.491841 -0.113355
C  -4.643879 1.165812 -0.178649
H  -4.938764 0.638101 -1.09055
C  -5.432662 2.461818 -0.053998
O  -4.901088 3.534013 0.011192
C  -2.285059 0.573217 -0.290904
C  -0.845598 1.104093 -0.341818
O  -2.512883 -0.625533 -0.356674
N  -0.003636 -0.063136 -0.173153
H  -0.681848 1.796637 0.488293
C  -0.576343 1.851168 -1.659102
H  -0.508158 -0.938202 -0.261483
H  -1.313044 2.643186 -1.788199
H  0.404143 2.321094 -1.606575
O  -6.763759 2.337786 -0.019607
H  -7.040411 1.417589 -0.081322
H  -4.872336 0.509557 0.666684
S  -0.521015 0.793496 -3.119528
H  -1.782807 0.349472 -3.065201
C  1.31384 -0.031056 -0.100481
O  1.940757 1.048124 -0.035634
C  2.026071 -1.368714 -0.128452
H  1.35398 -2.138556 0.252233
H  2.194101 -1.612445 -1.182875
C  3.336569 -1.419131 0.668432
H  3.583021 -2.464396 0.853838
H  3.203308 -0.951895 1.647099
C  4.566357 -0.800306 -0.005832
H  5.451108 -1.037756 0.588144
N  4.460087 0.682341 -0.133256
H  4.848752 0.95627 -1.041331
H  3.390838 0.94555 -0.100753
C  4.818099 -1.331505 -1.414154
O  4.979354 -0.607144 -2.360234
O  4.846908 -2.658182 -1.442551
H  5.043537 -2.95086 -2.34453
H  4.952482 1.168054 0.610463
totalener: -1406.25150799 hartree
nucrepener: 1756.83080451 hartree
electener: -3163.08231250 hartree
oneelecener: -5398.44877785 hartree
twoeener: 2235.36646535 hartree
kineticenergy: 1400.64143604 hartree
exchangeener: -105.325591457314 hartree
correlationener: -7.051969887998 hartree
xcener: -112.377561345312 hartree
temp: 298.15 k
press: 1.00 atm
thermalcorrenthalpy: 0.00094421 hartree
totalenthalpy: -1406.00063387 hartree
totalentropycorr: -0.06655772 hartree
gibbsenthalpy: -1406.06719159 hartree
gibbsminuselec: 0.26051923 hartree
chargesum: 1.0000000
charge: -0.184347 0.182756 -0.127425 0.130915 0.325492 -0.301040 0.208687 0.036302 -0.381556 -0.132489 0.130886 -0.164497 0.192769 0.129610 0.136732 -0.212128 0.219817 0.133042 -0.153502 0.110979 0.277090 -0.430560 -0.155716 0.131768 0.121138 -0.202185 0.145747 0.133941 -0.018485 0.151715 -0.083920 0.216163 0.215481 0.281755 -0.289954 -0.249313 0.257661 0.216668
charge: 0.338406 -0.022963 -0.045589 0.033268 -0.431115 0.138242 -0.389739 -0.119844 0.084630 0.372356 0.039739 -0.244036 -0.015895 0.007327 0.009088 0.395786 -0.093485 0.034468 0.486568 -0.146375 -0.332898 0.156737 0.002102 0.042126 0.042584 0.002736 0.044804 0.036461 -0.058712 0.046685 0.588195 0.022766 -0.095033 -0.440237 0.142910 0.401257 -0.063520 0.030200
qa: -0.1843 0.1828 -0.1274 0.1309 0.3255 -0.3010 0.2087 0.0363 -0.3816 -0.1325 0.1309 -0.1645 0.1928 0.1296 0.1367 -0.2121 0.2198 0.1330 -0.1535 0.1110 0.2771 -0.4306 -0.1557 0.1318 0.1211 -0.2022 0.1457 0.1339 -0.0185 0.1517 -0.0839 0.2162 0.2155 0.2818 -0.2900 -0.2493 0.2577 0.2167
va: 3.1794 1.0456 3.8885 0.9966 4.3075 2.1956 4.2710 3.9050 2.1325 3.3086 1.0138 3.8793 1.0456 1.0171 1.0128 2.2674 1.0214 0.9961 2.1517 1.0280 4.1384 2.0884 3.8172 1.0056 1.0185 3.8842 1.0090 1.0047 3.9329 1.0012 3.5153 1.0174 1.1209 4.3435 2.1991 2.2638 1.0027 0.9847
dispcorr: -0.076872013 hartree
energy: -1406.333106542026
dipole: 9.63408 -5.48069 4.15339 -4.35337 2.47938 -1.87399 5.25781 -3.82519 1.43262
magnitude: 4.77649 au
magnitude: 12.14088 debye
zeropoint: 0.30884602 hartree
thermalvibcorrection: 0.01875441 hartree
thermalrotcorrection: 0.00141627 hartree
thermaltrasncorrection: 0.00141627 hartree
thermaltotal: -1406.00267357 hartree
thermalcorr: 0.02158695 hartree
nonthermalcorr: 0.30884602 hartree
totalcorr: 0.33043297 hartree
totalenthalpy: -1406.00172936 hartree
