program: Orca
programVersion: 5.0.2
elementType: N H C H C O C C O N H C H H H O H H S H C O C H H C H H C H N H H C O O H H
charge: 1
multiplicity: 1
keywords: wB97X-D3BJ Opt Freq def2-TZVPP def2/J RIJCOSX VeryTightSCF
keywords: PAL8 defgrid3 TightOpt
frequency: 0.00 0.00 0.00 0.00 0.00 0.00 22.49 25.60 45.03 54.67 62.18 72.26 89.59 107.01 116.38 120.95 149.42 179.08 201.58 215.24 223.32 238.79 266.59 294.52 300.02 330.21 333.92 339.61 357.20 365.25 424.88 469.57 507.33 509.18 537.07 553.44 578.58 612.02 646.80 660.62 667.74 674.45 681.91 694.49 734.07 745.50 785.31 812.21 825.64 878.94 881.66 890.33 913.97 949.32 979.60 997.71 1007.93 1021.35 1035.30 1072.26 1082.85 1117.23 1131.44 1149.38 1171.10 1201.02 1230.86 1253.56 1256.33 1264.49 1288.56 1295.83 1309.26 1334.55 1342.52 1360.02 1364.45 1370.67 1398.25 1408.43 1438.11 1450.81 1461.19 1461.69 1471.32 1475.64 1479.37 1509.66 1566.23 1600.69 1637.09 1672.72 1761.11 1804.80 1822.81 1825.68 2759.06 3009.66 3068.10 3077.07 3095.12 3121.05 3121.46 3127.78 3138.12 3148.81 3152.43 3173.66 3178.85 3504.81 3566.34 3566.72 3662.65 3804.15
frequency: 22.49 25.60 45.03 54.67 62.18 72.26 89.59 107.01 116.38 120.95 149.42 179.08 201.58 215.24 223.32 238.79 266.59 294.52 300.02 330.21 333.92 339.61 357.20 365.25 424.88 469.57 507.33 509.18 537.07 553.44 578.58 612.02 646.80 660.62 667.74 674.45 681.91 694.49 734.07 745.50 785.31 812.21 825.64 878.94 881.66 890.33 913.97 949.32 979.60 997.71 1007.93 1021.35 1035.30 1072.26 1082.85 1117.23 1131.44 1149.38 1171.10 1201.02 1230.86 1253.56 1256.33 1264.49 1288.56 1295.83 1309.26 1334.55 1342.52 1360.02 1364.45 1370.67 1398.25 1408.43 1438.11 1450.81 1461.19 1461.69 1471.32 1475.64 1479.37 1509.66 1566.23 1600.69 1637.09 1672.72 1761.11 1804.80 1822.81 1825.68 2759.06 3009.66 3068.10 3077.07 3095.12 3121.05 3121.46 3127.78 3138.12 3148.81 3152.43 3173.66 3178.85 3504.81 3566.34 3566.72 3662.65 3804.15
formula: C10H18N3O6S
InChI: InChI=1S/C10H18N3O6S/c11-5(10(18)19)1-2-7(14)13-6(4-20)9(17)12-3-8(15)16/h5-6,12-13,15,18,20H,1-4H2,11H3
38 atoms
N  -2.48615 0.115245 1.412279
H  -1.684696 -0.035666 2.00215
C  -3.537527 -0.867826 1.484773
H  -3.749721 -1.129961 2.521472
C  -3.143907 -2.125122 0.722376
O  -2.079901 -2.287352 0.171806
C  -2.25948 0.727434 0.214307
C  -0.818583 1.20729 0.012652
O  -3.111234 0.828474 -0.643415
N  -0.005769 -0.004047 -0.04049
H  -0.511388 1.787511 0.889865
C  -0.683171 2.145537 -1.18767
H  -0.483696 -0.893098 -0.117686
H  -1.412897 2.946986 -1.080242
H  0.312867 2.58469 -1.181808
O  -4.114568 -3.034912 0.74152
H  -3.822713 -3.810465 0.243557
H  -4.452797 -0.469603 1.048392
S  -0.874321 1.429265 -2.836939
H  -2.046324 0.818855 -2.627321
C  1.340064 0.041884 -0.022111
O  1.969307 1.089309 0.0143
C  2.061464 -1.304592 -0.042256
H  2.124292 -1.655515 0.990705
H  1.49302 -2.046969 -0.602499
C  3.483492 -1.129398 -0.571069
H  4.096857 -1.987109 -0.288387
H  3.886693 -0.236642 -0.08547
C  3.600587 -0.942658 -2.094198
H  3.602707 -1.902745 -2.609296
N  4.886942 -0.220431 -2.408306
H  4.56598 0.73784 -2.672508
H  5.513403 -0.178874 -1.606569
C  2.527781 -0.044314 -2.723554
O  2.812947 1.067739 -3.105932
O  1.370188 -0.640688 -2.780833
H  0.620956 0.009991 -2.949402
H  5.386872 -0.620192 -3.200324
totalener: -1406.23604047 hartree
nucrepener: 1904.52084904 hartree
electener: -3310.75688951 hartree
oneelecener: -5694.53382887 hartree
twoeener: 2383.77693936 hartree
kineticenergy: 1400.65336876 hartree
exchangeener: -105.322186377924 hartree
correlationener: -7.059084050942 hartree
xcener: -112.381270428866 hartree
temp: 298.15 k
press: 1.00 atm
thermalcorrenthalpy: 0.00094421 hartree
totalenthalpy: -1405.99064109 hartree
totalentropycorr: -0.06465485 hartree
gibbsenthalpy: -1406.05529594 hartree
gibbsminuselec: 0.26311808 hartree
chargesum: 1.0000000
charge: -0.201805 0.172568 -0.078685 0.143378 0.329017 -0.371283 0.255523 0.014682 -0.358626 -0.228135 0.130944 -0.170963 0.208865 0.145387 0.152417 -0.245170 0.240116 0.146632 -0.141743 0.151524 0.183727 -0.376789 -0.158846 0.129977 0.127604 -0.243200 0.145142 0.120431 0.014594 0.158107 -0.057793 0.236771 0.230522 0.321008 -0.306400 -0.277325 0.221595 0.236232
charge: 0.321095 -0.021324 -0.041587 0.038286 -0.424812 0.093207 -0.376623 -0.128874 0.113032 0.330433 0.042852 -0.222028 -0.031972 0.018685 0.012712 0.390140 -0.078412 0.045599 0.612989 -0.137408 -0.400699 0.080280 -0.001797 0.040707 0.030964 -0.007039 0.029549 0.031195 -0.031645 0.041727 0.615106 0.027788 0.047169 -0.461520 0.143924 0.393943 -0.186363 0.050722
qa: -0.2018 0.1726 -0.0787 0.1434 0.3290 -0.3713 0.2555 0.0147 -0.3586 -0.2281 0.1309 -0.1710 0.2089 0.1454 0.1524 -0.2452 0.2401 0.1466 -0.1417 0.1515 0.1837 -0.3768 -0.1588 0.1300 0.1276 -0.2432 0.1451 0.1204 0.0146 0.1581 -0.0578 0.2368 0.2305 0.3210 -0.3064 -0.2773 0.2216 0.2362
va: 3.2053 1.0214 3.8316 1.0052 4.2410 2.0958 4.2299 3.8253 2.1476 3.1354 1.0122 3.8860 1.0277 1.0046 1.0116 2.2528 1.0165 1.0186 2.3159 1.0266 4.2912 2.1335 3.8453 1.0036 1.0177 3.8849 0.9980 1.0337 3.7818 1.0047 3.6389 1.0310 0.9785 4.3290 2.1979 2.2225 1.1346 0.9738
dispcorr: -0.082288573 hartree
energy: -1406.324962002131
dipole: 12.62840 -7.70111 4.92729 -3.75540 1.57984 -2.17556 3.51057 -3.55406 -0.04349
magnitude: 5.38638 au
magnitude: 13.69110 debye
zeropoint: 0.31052712 hartree
thermalvibcorrection: 0.01810160 hartree
thermalrotcorrection: 0.00141627 hartree
thermaltrasncorrection: 0.00141627 hartree
thermaltotal: -1405.99350074 hartree
thermalcorr: 0.02093414 hartree
nonthermalcorr: 0.31052712 hartree
totalcorr: 0.33146126 hartree
totalenthalpy: -1405.99255653 hartree
