program: Orca
programVersion: 5.0.2
elementType: N H C H C O C C O N H C H H H O H H S H C O C H H C H H C H N H H C O O H H
charge: 1
multiplicity: 1
keywords: wB97X-D3BJ Opt Freq def2-TZVPP def2/J RIJCOSX VeryTightSCF
keywords: PAL8 defgrid3 TightOpt
frequency: 0.00 0.00 0.00 0.00 0.00 0.00 41.63 57.27 66.74 74.69 83.66 87.00 100.11 103.55 129.55 140.24 142.99 165.70 176.87 196.04 214.73 242.42 248.20 259.32 299.07 313.65 335.86 344.92 362.65 407.92 431.16 452.19 478.77 517.36 524.26 565.61 573.03 593.37 605.51 607.13 625.23 659.50 722.93 729.25 734.31 747.23 790.82 806.04 808.10 844.39 879.96 908.03 927.28 927.91 973.74 987.51 1012.80 1042.17 1067.87 1068.99 1092.68 1116.83 1134.27 1145.30 1191.81 1223.40 1225.23 1239.01 1251.87 1253.23 1286.06 1291.21 1302.89 1319.63 1348.21 1365.92 1370.12 1373.07 1381.61 1423.31 1430.02 1472.42 1478.00 1480.46 1487.57 1492.68 1499.68 1556.71 1569.13 1585.95 1656.97 1684.38 1733.17 1758.50 1822.01 1828.45 2631.88 2769.52 3068.57 3084.75 3099.26 3115.83 3127.68 3128.67 3129.17 3148.16 3174.74 3204.91 3497.90 3564.03 3622.99 3624.78 3669.30 3790.58
frequency: 41.63 57.27 66.74 74.69 83.66 87.00 100.11 103.55 129.55 140.24 142.99 165.70 176.87 196.04 214.73 242.42 248.20 259.32 299.07 313.65 335.86 344.92 362.65 407.92 431.16 452.19 478.77 517.36 524.26 565.61 573.03 593.37 605.51 607.13 625.23 659.50 722.93 729.25 734.31 747.23 790.82 806.04 808.10 844.39 879.96 908.03 927.28 927.91 973.74 987.51 1012.80 1042.17 1067.87 1068.99 1092.68 1116.83 1134.27 1145.30 1191.81 1223.40 1225.23 1239.01 1251.87 1253.23 1286.06 1291.21 1302.89 1319.63 1348.21 1365.92 1370.12 1373.07 1381.61 1423.31 1430.02 1472.42 1478.00 1480.46 1487.57 1492.68 1499.68 1556.71 1569.13 1585.95 1656.97 1684.38 1733.17 1758.50 1822.01 1828.45 2631.88 2769.52 3068.57 3084.75 3099.26 3115.83 3127.68 3128.67 3129.17 3148.16 3174.74 3204.91 3497.90 3564.03 3622.99 3624.78 3669.30 3790.58
formula: C10H18N3O6S
InChI: InChI=1S/C10H18N3O6S/c11-5(10(18)19)1-2-7(14)13-6(4-20)9(17)12-3-8(15)16/h5-6,12-13,15,18,20H,1-4H2,11H3
38 atoms
N  -0.11567 1.290096 2.484825
H  -0.071124 0.289834 2.388114
C  0.737984 1.8690 3.505066
H  0.529961 2.932287 3.585237
C  2.16198 1.626796 3.038614
O  2.604211 0.483385 2.938701
C  -0.40829 2.01776 1.359493
C  -0.773163 1.198982 0.110703
O  -0.402578 3.224373 1.325324
N  0.002259 -0.027407 0.005689
H  -0.516847 1.858457 -0.719217
C  -2.270496 0.898883 0.041125
H  -0.489088 -0.901372 0.117497
H  -2.814319 1.831237 0.182446
H  -2.51434 0.502698 -0.943037
O  2.810768 2.701818 2.679946
H  3.62279 2.471901 2.189745
H  0.574477 1.374402 4.461586
S  -2.776954 -0.315806 1.302161
H  -3.596563 -1.027135 0.522944
C  1.349407 0.002985 -0.0144
O  1.981604 1.051552 -0.029092
C  2.063508 -1.332838 0.036221
H  2.089622 -1.643809 1.086402
H  1.483642 -2.094928 -0.487582
C  3.465001 -1.294089 -0.578912
H  3.409105 -0.936521 -1.607638
H  3.83697 -2.320509 -0.629347
C  4.547003 -0.45437 0.112317
H  5.51358 -0.794413 -0.270507
N  4.572275 -0.649454 1.594692
H  3.76519 -0.144063 2.085425
H  4.548395 -1.637581 1.837848
C  4.539834 1.053354 -0.109382
O  4.70623 1.834489 0.799078
O  4.506679 1.362735 -1.389133
H  4.512735 2.326103 -1.484165
H  5.421458 -0.241975 1.984375
totalener: -1406.23997643 hartree
nucrepener: 1962.33561972 hartree
electener: -3368.57559615 hartree
oneelecener: -5808.84308207 hartree
twoeener: 2440.26748592 hartree
kineticenergy: 1400.66611176 hartree
exchangeener: -105.332891505690 hartree
correlationener: -7.060288314339 hartree
xcener: -112.393179820030 hartree
temp: 298.15 k
press: 1.00 atm
thermalcorrenthalpy: 0.00094421 hartree
totalenthalpy: -1405.99610500 hartree
totalentropycorr: -0.06426792 hartree
gibbsenthalpy: -1406.06037292 hartree
gibbsminuselec: 0.26405685 hartree
chargesum: 1.0000000
charge: -0.194861 0.159970 -0.068964 0.143190 0.386389 -0.424183 0.209347 0.051720 -0.304290 -0.211832 0.134491 -0.170181 0.165884 0.142739 0.137913 -0.208957 0.252952 0.139299 -0.164842 0.124985 0.268223 -0.417827 -0.182642 0.098220 0.131862 -0.210372 0.131963 0.144122 -0.026247 0.163760 -0.076363 0.208475 0.216657 0.384057 -0.389688 -0.231686 0.256048 0.230666
charge: 0.317606 -0.039677 -0.024199 0.041400 -0.395197 0.132784 -0.389187 -0.134015 0.127322 0.336002 0.048601 -0.213481 -0.037494 0.019486 0.010488 0.434117 -0.111615 0.034720 0.477671 -0.146357 -0.387317 0.103417 -0.013351 0.026937 0.039017 0.003729 0.048190 0.034762 -0.057557 0.050410 0.599887 -0.062165 0.041828 -0.443370 0.120121 0.418341 -0.060062 0.048206
qa: -0.1949 0.1600 -0.0690 0.1432 0.3864 -0.4242 0.2093 0.0517 -0.3043 -0.2118 0.1345 -0.1702 0.1659 0.1427 0.1379 -0.2090 0.2530 0.1393 -0.1648 0.1250 0.2682 -0.4178 -0.1826 0.0982 0.1319 -0.2104 0.1320 0.1441 -0.0262 0.1638 -0.0764 0.2085 0.2167 0.3841 -0.3897 -0.2317 0.2560 0.2307
va: 3.1348 1.0435 3.8594 1.0308 4.1668 2.1062 4.2846 3.8326 2.2395 3.1674 1.0244 3.9543 1.0605 1.0057 0.9931 2.3301 1.0440 0.9999 2.1764 1.0167 4.1495 2.0549 3.8310 1.0188 1.0127 3.9006 1.0206 0.9952 3.8253 0.9937 3.5911 1.1293 0.9826 4.3203 2.0959 2.2985 1.0061 0.9818
dispcorr: -0.084366547 hartree
energy: -1406.330622904568
dipole: 3.22459 -0.18604 3.03855 -11.19048 7.71513 -3.47535 -3.26762 2.65194 -0.61568
magnitude: 4.65724 au
magnitude: 11.83777 debye
zeropoint: 0.31104212 hartree
thermalvibcorrection: 0.01799340 hartree
thermalrotcorrection: 0.00141627 hartree
thermaltrasncorrection: 0.00141627 hartree
thermaltotal: -1405.99875485 hartree
thermalcorr: 0.02082594 hartree
nonthermalcorr: 0.31104212 hartree
totalcorr: 0.33186806 hartree
totalenthalpy: -1405.99781064 hartree
