program: Orca
programVersion: 5.0.2
elementType: N H C H C O C C O N H C H H H O H H S H C O C H H C H H C H N H H C O O H H
charge: 1
multiplicity: 1
keywords: wB97X-D3BJ Opt Freq def2-TZVPP def2/J RIJCOSX VeryTightSCF
keywords: PAL8 defgrid3 TightOpt
frequency: 0.00 0.00 0.00 0.00 0.00 0.00 7.70 18.76 23.34 31.05 35.96 44.86 55.17 83.39 97.09 104.07 121.31 138.46 141.72 170.16 172.56 193.41 218.09 248.33 270.04 286.22 294.21 299.89 336.43 381.04 393.35 447.75 454.80 503.45 519.63 534.52 547.81 582.62 584.98 592.28 614.91 624.51 657.92 684.76 707.95 739.67 760.35 798.15 834.86 844.32 851.89 878.83 949.46 952.65 979.91 992.82 1016.85 1022.60 1037.62 1074.41 1088.75 1096.63 1133.83 1154.27 1166.58 1196.35 1202.78 1207.16 1252.00 1259.33 1282.70 1292.62 1309.70 1313.55 1324.12 1338.14 1362.94 1369.65 1382.24 1390.11 1411.47 1427.88 1431.55 1488.79 1498.63 1502.35 1510.73 1527.53 1574.41 1592.72 1651.17 1661.06 1745.24 1789.96 1892.23 1903.77 2755.91 3057.77 3058.42 3075.83 3097.33 3101.34 3102.20 3107.33 3139.72 3143.59 3163.67 3441.08 3520.64 3535.53 3586.93 3686.22 3779.25 3861.86
frequency: 7.70 18.76 23.34 31.05 35.96 44.86 55.17 83.39 97.09 104.07 121.31 138.46 141.72 170.16 172.56 193.41 218.09 248.33 270.04 286.22 294.21 299.89 336.43 381.04 393.35 447.75 454.80 503.45 519.63 534.52 547.81 582.62 584.98 592.28 614.91 624.51 657.92 684.76 707.95 739.67 760.35 798.15 834.86 844.32 851.89 878.83 949.46 952.65 979.91 992.82 1016.85 1022.60 1037.62 1074.41 1088.75 1096.63 1133.83 1154.27 1166.58 1196.35 1202.78 1207.16 1252.00 1259.33 1282.70 1292.62 1309.70 1313.55 1324.12 1338.14 1362.94 1369.65 1382.24 1390.11 1411.47 1427.88 1431.55 1488.79 1498.63 1502.35 1510.73 1527.53 1574.41 1592.72 1651.17 1661.06 1745.24 1789.96 1892.23 1903.77 2755.91 3057.77 3058.42 3075.83 3097.33 3101.34 3102.20 3107.33 3139.72 3143.59 3163.67 3441.08 3520.64 3535.53 3586.93 3686.22 3779.25 3861.86
formula: C10H18N3O6S
InChI: InChI=1S/C10H18N3O6S/c11-5(10(18)19)1-2-7(14)13-6(4-20)9(17)12-3-8(15)16/h5-6,12-13,15,18,20H,1-4H2,11H3
38 atoms
N  -0.385505 2.921843 -2.201197
H  -0.586674 3.608434 -1.486268
C  0.025967 3.449552 -3.475912
H  1.105876 3.338547 -3.625619
C  -0.330902 4.928055 -3.525016
O  -0.789514 5.521199 -2.593848
C  -0.180392 1.637825 -1.882722
C  -0.754307 1.168572 -0.527832
O  0.324685 0.827441 -2.65123
N  0.001427 0.006011 -0.073857
H  -1.734268 0.766037 -0.803879
C  -1.048482 2.205712 0.565414
H  -0.457233 -0.87969 -0.191309
H  -1.944765 2.761719 0.283551
H  -1.29508 1.652425 1.471071
O  -0.081772 5.544369 -4.693177
H  0.268274 4.93169 -5.347117
H  -0.471856 2.916304 -4.290681
S  0.184247 3.480716 0.938204
H  1.259451 2.689304 0.859214
C  1.355427 -0.019463 -0.100478
O  2.057197 0.974799 -0.092216
C  1.995999 -1.394157 -0.241185
H  2.721136 -1.524439 0.564196
H  1.271646 -2.205879 -0.188859
C  2.704318 -1.357524 -1.598088
H  3.402453 -0.515135 -1.573417
H  1.974252 -1.146854 -2.387449
C  3.482028 -2.630173 -1.923462
H  4.164046 -2.899361 -1.116018
N  4.331489 -2.354562 -3.147471
H  3.729663 -2.121632 -3.940647
H  4.953373 -1.564013 -2.971277
C  2.563491 -3.814829 -2.19564
O  1.958131 -4.375192 -1.337039
O  2.510445 -4.105609 -3.510371
H  1.890487 -4.837057 -3.648059
H  4.891254 -3.16344 -3.420744
totalener: -1406.20073733 hartree
nucrepener: 1783.88809850 hartree
electener: -3190.08883583 hartree
oneelecener: -5454.01315283 hartree
twoeener: 2263.92431700 hartree
kineticenergy: 1400.61346206 hartree
exchangeener: -105.307737275572 hartree
correlationener: -7.046892494100 hartree
xcener: -112.354629769672 hartree
temp: 298.15 k
press: 1.00 atm
thermalcorrenthalpy: 0.00094421 hartree
totalenthalpy: -1405.94786073 hartree
totalentropycorr: -0.06745996 hartree
gibbsenthalpy: -1406.01532069 hartree
gibbsminuselec: 0.26215245 hartree
chargesum: 1.0000000
charge: -0.165829 0.194582 -0.119370 0.112327 0.315163 -0.282670 0.274893 -0.009790 -0.446876 -0.160258 0.114135 -0.172667 0.166385 0.138678 0.117801 -0.221495 0.211196 0.117279 -0.168763 0.137897 0.258574 -0.398326 -0.173461 0.115501 0.106815 -0.208631 0.122544 0.131803 0.010262 0.170472 -0.041318 0.245069 0.243932 0.282692 -0.231910 -0.298198 0.263115 0.248447
charge: 0.338280 -0.037583 -0.054596 0.028438 -0.432050 0.147423 -0.380584 -0.122392 0.040270 0.336773 0.045879 -0.248848 -0.023627 0.012881 0.007420 0.383863 -0.101811 0.030263 0.485753 -0.160304 -0.383449 0.100054 0.007343 0.037259 0.024172 -0.008988 0.037109 0.038944 -0.039650 0.051633 0.615766 0.063204 0.061263 -0.436271 0.183624 0.354421 -0.062408 0.060526
qa: -0.1658 0.1946 -0.1194 0.1123 0.3152 -0.2827 0.2749 -0.0098 -0.4469 -0.1603 0.1141 -0.1727 0.1664 0.1387 0.1178 -0.2215 0.2112 0.1173 -0.1688 0.1379 0.2586 -0.3983 -0.1735 0.1155 0.1068 -0.2086 0.1225 0.1318 0.0103 0.1705 -0.0413 0.2451 0.2439 0.2827 -0.2319 -0.2982 0.2631 0.2484
va: 3.1695 1.0514 3.8993 0.9974 4.3302 2.2123 4.1966 3.9245 2.0730 3.1791 0.9999 3.9477 1.0188 0.9936 1.0099 2.2504 1.0277 0.9985 2.1463 1.0351 4.2487 2.1061 3.9370 1.0220 1.0357 3.8791 1.0361 1.0312 3.7170 0.9963 3.6713 0.9779 0.9677 4.3456 2.2711 2.1891 1.0019 0.9685
dispcorr: -0.076958590 hartree
energy: -1406.283270801241
dipole: 7.18351 -2.80645 4.37706 -11.63849 5.06294 -6.57555 -2.89009 -0.38905 -3.27914
magnitude: 8.55274 au
magnitude: 21.73934 debye
zeropoint: 0.30961751 hartree
thermalvibcorrection: 0.01962998 hartree
thermalrotcorrection: 0.00141627 hartree
thermaltrasncorrection: 0.00141627 hartree
thermaltotal: -1405.95119077 hartree
thermalcorr: 0.02246252 hartree
nonthermalcorr: 0.30961751 hartree
totalcorr: 0.33208003 hartree
totalenthalpy: -1405.95024656 hartree
