program: Orca
programVersion: 5.0.2
elementType: N H C H C O C C O N H C H H H O H H S H C O C H H C H H C H N H H C O O H H
charge: 1
multiplicity: 1
keywords: wB97X-D3BJ Opt Freq def2-TZVPP def2/J RIJCOSX VeryTightSCF
keywords: PAL8 defgrid3 TightOpt
frequency: 0.00 0.00 0.00 0.00 0.00 0.00 11.69 25.07 27.10 41.21 55.75 67.19 68.93 83.88 98.94 123.29 137.92 153.97 168.10 194.70 212.34 224.03 243.12 255.05 303.56 318.76 326.33 351.90 362.52 402.84 434.62 453.25 469.74 510.26 514.63 525.93 596.43 601.23 607.54 653.36 662.59 705.45 716.75 734.01 743.75 745.07 787.89 804.53 845.75 853.10 883.77 906.13 928.81 946.01 963.26 993.35 1024.23 1041.60 1068.15 1076.65 1097.29 1115.59 1144.23 1157.91 1182.13 1212.20 1230.83 1244.41 1251.69 1260.79 1293.36 1306.39 1311.10 1319.34 1330.52 1368.60 1377.71 1381.92 1392.99 1416.98 1423.03 1440.29 1462.05 1476.90 1479.46 1483.95 1494.59 1565.97 1593.04 1618.71 1642.92 1666.92 1715.74 1749.27 1855.64 1890.86 2315.29 2752.38 3076.00 3084.95 3098.44 3106.99 3130.68 3137.10 3140.79 3149.61 3157.55 3193.79 3425.91 3552.14 3625.99 3648.49 3679.55 3782.62
frequency: 11.69 25.07 27.10 41.21 55.75 67.19 68.93 83.88 98.94 123.29 137.92 153.97 168.10 194.70 212.34 224.03 243.12 255.05 303.56 318.76 326.33 351.90 362.52 402.84 434.62 453.25 469.74 510.26 514.63 525.93 596.43 601.23 607.54 653.36 662.59 705.45 716.75 734.01 743.75 745.07 787.89 804.53 845.75 853.10 883.77 906.13 928.81 946.01 963.26 993.35 1024.23 1041.60 1068.15 1076.65 1097.29 1115.59 1144.23 1157.91 1182.13 1212.20 1230.83 1244.41 1251.69 1260.79 1293.36 1306.39 1311.10 1319.34 1330.52 1368.60 1377.71 1381.92 1392.99 1416.98 1423.03 1440.29 1462.05 1476.90 1479.46 1483.95 1494.59 1565.97 1593.04 1618.71 1642.92 1666.92 1715.74 1749.27 1855.64 1890.86 2315.29 2752.38 3076.00 3084.95 3098.44 3106.99 3130.68 3137.10 3140.79 3149.61 3157.55 3193.79 3425.91 3552.14 3625.99 3648.49 3679.55 3782.62
formula: C10H18N3O6S
InChI: InChI=1S/C10H18N3O6S/c11-5(10(18)19)1-2-7(14)13-6(4-20)9(17)12-3-8(15)16/h5-6,12-13,15,18,20H,1-4H2,11H3
38 atoms
N  -2.58124 1.96241 1.394475
H  -2.109661 2.849894 1.361518
C  -3.762262 1.837655 2.245866
H  -4.175705 2.827967 2.414466
C  -3.427694 1.225048 3.612098
O  -3.536454 1.836548 4.633545
C  -2.054764 0.913589 0.749777
C  -0.877967 1.192239 -0.185298
O  -2.495247 -0.228812 0.842207
N  -0.056784 -0.002746 -0.188764
H  -0.2680 2.020852 0.173811
C  -1.426472 1.501561 -1.588232
H  -0.563518 -0.875275 -0.148467
H  -2.074922 0.683009 -1.906831
H  -2.035324 2.404894 -1.555441
O  -2.99249 -0.0423 3.576824
H  -2.973436 -0.36977 2.66155
H  -4.500339 1.220421 1.730046
S  -0.162051 1.643081 -2.866509
H  0.392954 2.776961 -2.422435
C  1.269952 0.00887 -0.173551
O  1.917748 1.071072 -0.133928
C  1.959683 -1.341626 -0.177291
H  2.209321 -1.584912 0.860556
H  1.258855 -2.106122 -0.513602
C  3.21424 -1.401333 -1.061519
H  3.031627 -0.899294 -2.016144
H  3.417399 -2.44785 -1.290052
C  4.495784 -0.843438 -0.428756
H  4.651181 -1.28729 0.555354
N  4.435452 0.63903 -0.282645
H  4.860292 1.051795 -1.119339
H  3.38928 0.935716 -0.185579
C  5.702103 -1.142737 -1.315566
O  6.261161 -0.285826 -1.946871
O  6.011451 -2.432074 -1.308016
H  6.763071 -2.584087 -1.899677
H  4.976076 0.963851 0.515251
totalener: -1406.24775818 hartree
nucrepener: 1745.65222669 hartree
electener: -3151.89998486 hartree
oneelecener: -5375.24187620 hartree
twoeener: 2223.34189134 hartree
kineticenergy: 1400.63972068 hartree
exchangeener: -105.323969819144 hartree
correlationener: -7.051058184030 hartree
xcener: -112.375028003174 hartree
temp: 298.15 k
press: 1.00 atm
thermalcorrenthalpy: 0.00094421 hartree
totalenthalpy: -1405.99528806 hartree
totalentropycorr: -0.06635153 hartree
gibbsenthalpy: -1406.06163958 hartree
gibbsminuselec: 0.26171204 hartree
chargesum: 1.0000000
charge: -0.200675 0.192641 -0.121570 0.134834 0.263929 -0.268817 0.315391 0.018602 -0.433359 -0.147300 0.109817 -0.162903 0.193950 0.133581 0.126308 -0.244077 0.229023 0.147915 -0.129174 0.101577 0.307381 -0.421106 -0.178402 0.122122 0.119789 -0.223131 0.134186 0.148373 0.007485 0.143543 -0.083290 0.219468 0.214569 0.284807 -0.291037 -0.243303 0.258557 0.220297
charge: 0.345373 -0.012331 -0.027283 0.036310 -0.453750 0.142576 -0.374826 -0.123799 0.089288 0.372610 0.032127 -0.242480 -0.004801 0.019762 0.010441 0.369978 -0.139156 0.033620 0.494382 -0.148318 -0.340790 0.151548 0.002775 0.042379 0.039297 0.006197 0.040082 0.044794 -0.058237 0.043496 0.591946 0.031325 -0.091785 -0.438520 0.140505 0.400993 -0.062045 0.036316
qa: -0.2007 0.1926 -0.1216 0.1348 0.2639 -0.2688 0.3154 0.0186 -0.4334 -0.1473 0.1098 -0.1629 0.1939 0.1336 0.1263 -0.2441 0.2290 0.1479 -0.1292 0.1016 0.3074 -0.4211 -0.1784 0.1221 0.1198 -0.2231 0.1342 0.1484 0.0075 0.1435 -0.0833 0.2195 0.2146 0.2848 -0.2910 -0.2433 0.2586 0.2203
va: 3.2297 1.0037 3.8181 1.0099 4.3520 2.2290 4.2048 3.8922 2.0692 3.3093 1.0325 3.9640 1.0290 1.0108 1.0109 2.2036 1.0522 0.9994 2.1836 1.0244 4.1498 2.0919 3.8401 1.0034 1.0127 3.8724 1.0132 1.0130 3.8659 1.0072 3.5367 1.0129 1.1196 4.3642 2.1985 2.2692 1.0012 0.9845
dispcorr: -0.076004040 hartree
energy: -1406.328881805522
dipole: 5.42245 -1.17256 4.24989 -1.22585 0.68750 -0.53834 -4.03569 2.10477 -1.93092
magnitude: 4.69892 au
magnitude: 11.94371 debye
zeropoint: 0.30998939 hartree
thermalvibcorrection: 0.01858942 hartree
thermalrotcorrection: 0.00141627 hartree
thermaltrasncorrection: 0.00141627 hartree
thermaltotal: -1405.99747045 hartree
thermalcorr: 0.02142196 hartree
nonthermalcorr: 0.30998939 hartree
totalcorr: 0.33141136 hartree
totalenthalpy: -1405.99652624 hartree
