program: Orca
programVersion: 5.0.2
elementType: N H C H C O C C O N H C H H H O H H S H C O C H H C H H C H N H H C O O H H
charge: 1
multiplicity: 1
keywords: wB97X-D3BJ Opt Freq def2-TZVPP def2/J RIJCOSX VeryTightSCF
keywords: PAL8 defgrid3 TightOpt
frequency: 0.00 0.00 0.00 0.00 0.00 0.00 35.57 48.47 54.85 70.02 70.45 90.17 97.05 112.16 133.23 138.67 153.35 178.70 193.22 209.76 220.71 242.05 247.92 267.94 277.77 299.93 321.81 333.85 341.88 344.53 415.79 456.28 486.55 498.92 516.33 539.92 568.92 577.34 587.26 617.25 630.40 679.82 725.46 746.28 768.04 786.39 804.91 811.65 834.28 878.58 883.90 891.57 913.94 928.23 967.47 1002.33 1029.79 1034.33 1062.04 1065.67 1093.42 1109.02 1116.93 1142.27 1182.16 1211.08 1216.54 1232.04 1252.76 1254.31 1290.83 1293.52 1310.80 1321.14 1359.10 1364.76 1384.02 1385.36 1421.97 1423.52 1431.07 1451.99 1459.52 1477.41 1480.78 1484.94 1503.57 1521.18 1563.38 1594.07 1627.41 1677.61 1725.93 1750.65 1856.04 1869.89 2754.33 3053.67 3091.55 3102.40 3103.70 3118.78 3127.96 3128.34 3154.76 3161.44 3200.42 3309.64 3329.23 3394.34 3558.55 3655.89 3670.65 3796.05
frequency: 35.57 48.47 54.85 70.02 70.45 90.17 97.05 112.16 133.23 138.67 153.35 178.70 193.22 209.76 220.71 242.05 247.92 267.94 277.77 299.93 321.81 333.85 341.88 344.53 415.79 456.28 486.55 498.92 516.33 539.92 568.92 577.34 587.26 617.25 630.40 679.82 725.46 746.28 768.04 786.39 804.91 811.65 834.28 878.58 883.90 891.57 913.94 928.23 967.47 1002.33 1029.79 1034.33 1062.04 1065.67 1093.42 1109.02 1116.93 1142.27 1182.16 1211.08 1216.54 1232.04 1252.76 1254.31 1290.83 1293.52 1310.80 1321.14 1359.10 1364.76 1384.02 1385.36 1421.97 1423.52 1431.07 1451.99 1459.52 1477.41 1480.78 1484.94 1503.57 1521.18 1563.38 1594.07 1627.41 1677.61 1725.93 1750.65 1856.04 1869.89 2754.33 3053.67 3091.55 3102.40 3103.70 3118.78 3127.96 3128.34 3154.76 3161.44 3200.42 3309.64 3329.23 3394.34 3558.55 3655.89 3670.65 3796.05
formula: C10H18N3O6S
InChI: InChI=1S/C10H18N3O6S/c11-5(10(18)19)1-2-7(14)13-6(4-20)9(17)12-3-8(15)16/h5-6,12-13,15,18,20H,1-4H2,11H3
38 atoms
N  -0.879428 1.639303 2.786555
H  -0.271251 2.419553 2.601216
C  -0.91488 1.123955 4.149628
H  -0.733393 1.936366 4.847245
C  0.186419 0.077245 4.323768
O  1.175549 0.230764 4.985934
C  -1.233324 0.867617 1.750158
C  -0.825701 1.324869 0.346309
O  -1.783241 -0.226374 1.893821
N  0.094043 0.306292 -0.165261
H  -0.308337 2.283321 0.390519
C  -2.043449 1.434338 -0.562882
H  -0.288632 -0.385741 -0.789205
H  -1.724582 1.739892 -1.559896
H  -2.544749 0.469381 -0.64155
O  0.021568 -1.054673 3.605595
H  -0.793832 -0.986077 3.051996
H  -1.893214 0.684079 4.346806
S  -3.210693 2.685154 0.014433
H  -3.815511 1.919573 0.930314
C  1.196022 -0.011372 0.547268
O  1.601538 0.706226 1.456789
C  1.849319 -1.346518 0.267643
H  1.264414 -2.081928 0.834156
H  1.732646 -1.626349 -0.780742
C  3.336032 -1.44045 0.631503
H  3.930398 -0.906732 -0.109729
H  3.621803 -2.491097 0.551506
C  3.80713 -0.921666 1.997468
H  4.758479 -1.411402 2.224711
N  2.895378 -1.228205 3.141887
H  1.901478 -1.148001 2.897801
H  3.051395 -2.147932 3.54693
C  4.11324 0.571575 2.127794
O  4.006122 1.143093 3.178685
O  4.611052 1.089702 1.011841
H  4.855456 2.009601 1.18548
H  3.036974 -0.506917 3.869236
totalener: -1406.23690776 hartree
nucrepener: 1963.40611363 hartree
electener: -3369.64302139 hartree
oneelecener: -5809.89899041 hartree
twoeener: 2440.25596901 hartree
kineticenergy: 1400.65161070 hartree
exchangeener: -105.325954870075 hartree
correlationener: -7.059902493356 hartree
xcener: -112.385857363431 hartree
temp: 298.15 k
press: 1.00 atm
thermalcorrenthalpy: 0.00094421 hartree
totalenthalpy: -1405.99266217 hartree
totalentropycorr: -0.06416650 hartree
gibbsenthalpy: -1406.05682867 hartree
gibbsminuselec: 0.26454449 hartree
chargesum: 1.0000000
charge: -0.106249 0.198512 -0.106573 0.142644 0.318061 -0.318679 0.132644 0.108367 -0.408094 -0.183831 0.107581 -0.181380 0.181554 0.140615 0.133455 -0.323722 0.246904 0.153823 -0.126134 0.114781 0.294804 -0.449054 -0.217576 0.127398 0.127861 -0.173765 0.121881 0.135371 -0.013279 0.147861 -0.039261 0.221600 0.226283 0.327968 -0.297564 -0.251986 0.247839 0.239341
charge: 0.351902 -0.005435 -0.022244 0.041012 -0.432945 0.129284 -0.380753 -0.137013 0.104989 0.347065 0.034320 -0.241655 -0.011816 0.015067 0.011067 0.346176 -0.153367 0.038583 0.507962 -0.143010 -0.376481 0.093092 -0.011838 0.036624 0.040613 0.005535 0.042764 0.035060 -0.052056 0.049478 0.616901 0.015801 0.046634 -0.453172 0.142479 0.395348 -0.067590 0.041617
qa: -0.1062 0.1985 -0.1066 0.1426 0.3181 -0.3187 0.1326 0.1084 -0.4081 -0.1838 0.1076 -0.1814 0.1816 0.1406 0.1335 -0.3237 0.2469 0.1538 -0.1261 0.1148 0.2948 -0.4491 -0.2176 0.1274 0.1279 -0.1738 0.1219 0.1354 -0.0133 0.1479 -0.0393 0.2216 0.2263 0.3280 -0.2976 -0.2520 0.2478 0.2393
va: 3.1859 1.0069 3.8472 1.0094 4.1740 2.1699 4.2358 3.8599 2.1148 3.2749 1.0291 3.9499 1.0200 1.0014 1.0106 2.1319 1.0693 0.9989 2.1655 1.0231 4.1175 2.0237 3.8808 1.0068 1.0133 3.8803 1.0226 0.9992 3.9277 0.9963 3.6606 1.0432 0.9775 4.3407 2.2045 2.2602 1.0116 1.0212
dispcorr: -0.083912584 hartree
energy: -1406.333039026682
dipole: 3.47582 -1.52081 1.95502 -8.31073 6.43225 -1.87848 -4.50814 3.68816 -0.81998
magnitude: 2.83251 au
magnitude: 7.19967 debye
zeropoint: 0.31153129 hartree
thermalvibcorrection: 0.01811870 hartree
thermalrotcorrection: 0.00141627 hartree
thermaltrasncorrection: 0.00141627 hartree
thermaltotal: -1406.00055649 hartree
thermalcorr: 0.02095125 hartree
nonthermalcorr: 0.31153129 hartree
totalcorr: 0.33248254 hartree
totalenthalpy: -1405.99961228 hartree
