program: Orca
programVersion: 5.0.2
elementType: N H C H C O C C O N H C H H H O H H S H C O C H H C H H C H N H H C O O H H
charge: 1
multiplicity: 1
keywords: wB97X-D3BJ Opt Freq def2-TZVPP def2/J RIJCOSX VeryTightSCF
keywords: PAL8 defgrid3 TightOpt
frequency: 0.00 0.00 0.00 0.00 0.00 0.00 21.68 26.22 35.20 39.93 47.78 63.01 72.98 101.16 131.50 136.02 157.73 163.15 189.70 199.96 204.26 227.97 241.18 259.86 290.39 312.17 335.88 347.74 364.75 386.60 430.31 451.97 484.36 516.64 534.96 564.07 573.81 592.85 621.84 635.22 650.34 664.06 700.11 707.48 722.89 731.02 750.86 803.42 851.79 862.97 887.07 891.81 920.87 933.71 951.77 983.96 1030.04 1047.87 1057.92 1073.45 1105.76 1135.36 1138.91 1156.46 1168.64 1197.30 1213.23 1230.07 1238.16 1278.94 1294.95 1301.23 1323.45 1331.58 1335.45 1346.18 1366.68 1368.38 1384.40 1414.72 1417.30 1425.45 1447.98 1466.81 1484.19 1491.10 1500.21 1571.14 1583.88 1623.88 1631.95 1685.15 1723.68 1762.13 1830.60 1890.53 2769.60 2983.38 3091.27 3094.45 3108.82 3109.55 3120.12 3146.61 3147.81 3161.82 3167.01 3172.24 3352.98 3519.49 3530.95 3642.79 3794.67 3801.04
frequency: 21.68 26.22 35.20 39.93 47.78 63.01 72.98 101.16 131.50 136.02 157.73 163.15 189.70 199.96 204.26 227.97 241.18 259.86 290.39 312.17 335.88 347.74 364.75 386.60 430.31 451.97 484.36 516.64 534.96 564.07 573.81 592.85 621.84 635.22 650.34 664.06 700.11 707.48 722.89 731.02 750.86 803.42 851.79 862.97 887.07 891.81 920.87 933.71 951.77 983.96 1030.04 1047.87 1057.92 1073.45 1105.76 1135.36 1138.91 1156.46 1168.64 1197.30 1213.23 1230.07 1238.16 1278.94 1294.95 1301.23 1323.45 1331.58 1335.45 1346.18 1366.68 1368.38 1384.40 1414.72 1417.30 1425.45 1447.98 1466.81 1484.19 1491.10 1500.21 1571.14 1583.88 1623.88 1631.95 1685.15 1723.68 1762.13 1830.60 1890.53 2769.60 2983.38 3091.27 3094.45 3108.82 3109.55 3120.12 3146.61 3147.81 3161.82 3167.01 3172.24 3352.98 3519.49 3530.95 3642.79 3794.67 3801.04
formula: C10H18N3O6S
InChI: InChI=1S/C10H18N3O6S/c11-5(10(18)19)1-2-7(14)13-6(4-20)9(17)12-3-8(15)16/h5-6,12-13,15,18,20H,1-4H2,11H3
38 atoms
N  -2.343287 0.441261 2.100667
H  -2.935789 0.171789 1.324732
C  -2.570718 -0.168916 3.387848
H  -2.348658 0.528636 4.195693
C  -1.69255 -1.400868 3.56696
O  -0.895104 -1.805646 2.75705
C  -1.144378 0.960685 1.817715
C  -0.779185 1.188333 0.343651
O  -0.305183 1.172499 2.697425
N  0.030498 0.031227 -0.019613
H  -0.108262 2.046483 0.32804
C  -1.91098 1.459052 -0.645706
H  -0.399353 -0.876538 0.068984
H  -2.564423 2.231213 -0.240728
H  -1.469823 1.826475 -1.570657
O  -1.917873 -1.975588 4.747315
H  -1.366781 -2.766851 4.819824
H  -3.616415 -0.460697 3.478877
S  -2.88382 -0.038707 -1.008995
H  -3.963243 0.584504 -1.491081
C  1.383615 0.079853 0.011011
O  2.005719 1.135635 0.058049
C  2.097058 -1.253802 0.091108
H  1.385007 -2.072451 0.210347
H  2.640237 -1.413755 -0.841875
C  3.093461 -1.250432 1.258199
H  3.944366 -0.605348 1.026578
H  3.478548 -2.260397 1.392936
C  2.481468 -0.815646 2.59947
H  1.475795 -1.231752 2.70346
N  2.351211 0.682377 2.70388
H  2.692357 1.125037 1.841049
H  1.342269 0.961684 2.765631
C  3.292332 -1.38444 3.759833
O  3.502467 -2.55266 3.883379
O  3.722961 -0.436392 4.614571
H  4.223756 -0.863665 5.323568
H  2.859902 1.030924 3.514906
totalener: -1406.25384854 hartree
nucrepener: 1907.33452219 hartree
electener: -3313.58837072 hartree
oneelecener: -5698.25578970 hartree
twoeener: 2384.66741897 hartree
kineticenergy: 1400.67689189 hartree
exchangeener: -105.330081788824 hartree
correlationener: -7.056706471318 hartree
xcener: -112.386788260142 hartree
temp: 298.15 k
press: 1.00 atm
thermalcorrenthalpy: 0.00094421 hartree
totalenthalpy: -1406.00642929 hartree
totalentropycorr: -0.06520033 hartree
gibbsenthalpy: -1406.07162962 hartree
gibbsminuselec: 0.26423530 hartree
chargesum: 1.0000000
charge: -0.158778 0.175494 -0.066082 0.141891 0.315243 -0.363694 0.261509 0.026357 -0.447790 -0.140148 0.144791 -0.157967 0.184962 0.137370 0.139314 -0.243292 0.242010 0.148104 -0.153701 0.132495 0.170062 -0.391125 -0.140669 0.104195 0.131470 -0.234631 0.127770 0.138386 0.049517 0.114803 -0.052877 0.223155 0.231148 0.287798 -0.255977 -0.286963 0.251571 0.214281
charge: 0.348509 -0.062657 -0.031999 0.044019 -0.431170 0.089153 -0.349006 -0.126815 0.112028 0.345507 0.046755 -0.214401 -0.019547 0.013497 0.013982 0.388974 -0.077383 0.042264 0.503488 -0.137014 -0.373770 0.085156 0.002322 0.031352 0.044855 0.008135 0.034225 0.043854 -0.039986 0.045327 0.604551 0.010837 -0.040874 -0.428231 0.163415 0.361724 -0.068672 0.017598
qa: -0.1588 0.1755 -0.0661 0.1419 0.3152 -0.3637 0.2615 0.0264 -0.4478 -0.1401 0.1448 -0.1580 0.1850 0.1374 0.1393 -0.2433 0.2420 0.1481 -0.1537 0.1325 0.1701 -0.3911 -0.1407 0.1042 0.1315 -0.2346 0.1278 0.1384 0.0495 0.1148 -0.0529 0.2232 0.2311 0.2878 -0.2560 -0.2870 0.2516 0.2143
va: 3.2139 1.0832 3.8081 1.0155 4.2708 2.1088 4.1801 3.8713 2.0508 3.1817 1.0382 3.9623 1.0243 0.9998 1.0014 2.2534 1.0156 1.0063 2.1988 1.0160 4.2783 2.1070 3.8208 1.0190 1.0100 3.9409 1.0078 1.0215 3.7431 1.0662 3.5393 1.0272 1.0829 4.3356 2.2545 2.1884 1.0085 1.0089
dispcorr: -0.082132158 hartree
energy: -1406.341478988883
dipole: 1.69328 -1.64917 0.04411 2.95157 -2.37768 0.57388 -3.31774 4.02129 0.70355
magnitude: 0.90900 au
magnitude: 2.31048 debye
zeropoint: 0.31112180 hartree
thermalvibcorrection: 0.01843200 hartree
thermalrotcorrection: 0.00141627 hartree
thermaltrasncorrection: 0.00141627 hartree
thermaltotal: -1406.00909264 hartree
thermalcorr: 0.02126455 hartree
nonthermalcorr: 0.31112180 hartree
totalcorr: 0.33238635 hartree
totalenthalpy: -1406.00814843 hartree
