program: Orca
programVersion: 5.0.2
elementType: N H C H C O C C O N H C H H H O H H S H C O C H H C H H C H N H H C O O H H
charge: 1
multiplicity: 1
keywords: wB97X-D3BJ Opt Freq def2-TZVPP def2/J RIJCOSX VeryTightSCF
keywords: PAL8 defgrid3 TightOpt
frequency: 0.00 0.00 0.00 0.00 0.00 0.00 16.24 35.99 45.94 57.32 68.06 74.07 84.23 86.71 113.24 148.71 154.66 171.02 179.97 199.47 213.37 216.33 248.37 269.88 293.83 316.72 333.21 336.28 375.94 409.20 420.71 474.54 493.99 525.33 528.44 538.40 557.12 579.05 599.88 639.01 642.25 662.73 667.86 704.62 777.54 787.08 794.63 806.98 818.75 862.68 881.39 901.59 936.44 958.00 969.29 995.22 1022.47 1029.86 1048.80 1064.83 1095.48 1137.28 1149.16 1177.25 1178.90 1208.45 1221.68 1240.45 1256.70 1268.84 1279.64 1286.61 1288.84 1336.83 1344.31 1359.76 1376.05 1380.08 1394.56 1401.44 1425.59 1465.06 1468.31 1494.32 1495.45 1503.30 1506.36 1509.57 1586.09 1601.59 1607.27 1703.39 1715.44 1731.09 1835.96 1847.37 2767.42 2825.59 3090.27 3094.70 3099.23 3108.94 3117.69 3119.16 3136.41 3144.90 3162.80 3170.91 3296.51 3461.90 3570.89 3631.85 3691.68 3801.91
frequency: 16.24 35.99 45.94 57.32 68.06 74.07 84.23 86.71 113.24 148.71 154.66 171.02 179.97 199.47 213.37 216.33 248.37 269.88 293.83 316.72 333.21 336.28 375.94 409.20 420.71 474.54 493.99 525.33 528.44 538.40 557.12 579.05 599.88 639.01 642.25 662.73 667.86 704.62 777.54 787.08 794.63 806.98 818.75 862.68 881.39 901.59 936.44 958.00 969.29 995.22 1022.47 1029.86 1048.80 1064.83 1095.48 1137.28 1149.16 1177.25 1178.90 1208.45 1221.68 1240.45 1256.70 1268.84 1279.64 1286.61 1288.84 1336.83 1344.31 1359.76 1376.05 1380.08 1394.56 1401.44 1425.59 1465.06 1468.31 1494.32 1495.45 1503.30 1506.36 1509.57 1586.09 1601.59 1607.27 1703.39 1715.44 1731.09 1835.96 1847.37 2767.42 2825.59 3090.27 3094.70 3099.23 3108.94 3117.69 3119.16 3136.41 3144.90 3162.80 3170.91 3296.51 3461.90 3570.89 3631.85 3691.68 3801.91
formula: C10H18N3O6S
InChI: InChI=1S/C10H18N3O6S/c11-5(10(18)19)1-2-7(14)13-6(4-20)9(17)12-3-8(15)16/h5-6,12-13,15,18,20H,1-4H2,11H3
38 atoms
N  -0.263158 3.371197 -1.129521
H  -0.147234 3.81691 -0.231884
C  0.020584 4.202133 -2.279504
H  0.831483 3.777491 -2.87616
C  0.426797 5.567863 -1.773939
O  0.518856 5.849194 -0.606506
C  -0.490018 2.0671 -1.251084
C  -0.759281 1.260687 0.033366
O  -0.546423 1.506825 -2.345974
N  0.014682 0.020766 -0.001675
H  -1.804471 0.954134 -0.040427
C  -0.575747 2.020684 1.3472
H  -0.481926 -0.850716 -0.058712
H  0.418209 2.459949 1.407121
H  -1.328937 2.805793 1.4053
O  0.670706 6.410353 -2.777426
H  0.919061 7.266138 -2.401854
H  -0.850382 4.296743 -2.931121
S  -0.823752 0.856947 2.717681
H  -1.081952 1.775516 3.653683
C  1.347801 0.004903 0.00254
O  2.005452 1.056759 0.026096
C  2.065089 -1.328014 -0.009704
H  2.709586 -1.309077 0.872423
H  1.369737 -2.15496 0.132361
C  2.908621 -1.609901 -1.277701
H  2.300111 -2.146132 -2.004027
H  3.722718 -2.283605 -1.001609
C  3.488272 -0.419808 -2.040397
H  4.160756 -0.788392 -2.817933
N  4.267852 0.51281 -1.16337
H  3.569238 0.845776 -0.438122
H  5.086936 0.079664 -0.745763
C  2.450104 0.492781 -2.713784
O  2.699104 1.656094 -2.911562
O  1.335053 -0.140627 -2.989658
H  0.585559 0.507006 -3.061787
H  4.533252 1.330848 -1.716875
totalener: -1406.24825794 hartree
nucrepener: 1918.19630166 hartree
electener: -3324.44455960 hartree
oneelecener: -5720.84290464 hartree
twoeener: 2396.39834504 hartree
kineticenergy: 1400.65933223 hartree
exchangeener: -105.334888238069 hartree
correlationener: -7.059495977596 hartree
xcener: -112.394384215665 hartree
temp: 298.15 k
press: 1.00 atm
thermalcorrenthalpy: 0.00094421 hartree
totalenthalpy: -1406.00234632 hartree
totalentropycorr: -0.06497503 hartree
gibbsenthalpy: -1406.06732134 hartree
gibbsminuselec: 0.26306723 hartree
chargesum: 1.0000000
charge: -0.139557 0.181375 -0.056663 0.124534 0.301283 -0.325888 0.263574 0.077565 -0.446941 -0.170652 0.135266 -0.240856 0.200695 0.135544 0.145395 -0.252975 0.242137 0.138508 -0.152907 0.122942 0.331697 -0.436850 -0.233087 0.143255 0.109788 -0.191207 0.134819 0.134552 -0.017540 0.164111 -0.072800 0.229742 0.218673 0.308956 -0.332648 -0.275503 0.269085 0.232577
charge: 0.359972 -0.023099 -0.023849 0.038801 -0.432511 0.111695 -0.359751 -0.124891 0.109984 0.364862 0.048731 -0.239277 -0.007257 -0.001352 0.009342 0.383590 -0.076892 0.040715 0.476858 -0.141821 -0.358882 0.127023 0.004938 0.040953 0.036577 0.001753 0.043138 0.032222 -0.051653 0.046099 0.603566 -0.031612 0.035773 -0.465205 0.120260 0.394404 -0.136052 0.042847
qa: -0.1396 0.1814 -0.0567 0.1245 0.3013 -0.3259 0.2636 0.0776 -0.4469 -0.1707 0.1353 -0.2409 0.2007 0.1355 0.1454 -0.2530 0.2421 0.1385 -0.1529 0.1229 0.3317 -0.4368 -0.2331 0.1433 0.1098 -0.1912 0.1348 0.1346 -0.0175 0.1641 -0.0728 0.2297 0.2187 0.3090 -0.3326 -0.2755 0.2691 0.2326
va: 3.2169 1.0429 3.8529 1.0211 4.3225 2.1645 4.1997 3.8148 2.0647 3.2478 1.0085 3.9975 1.0009 1.0070 0.9987 2.2439 1.0148 1.0075 2.1746 1.0196 4.0614 2.0730 3.8678 1.0091 1.0202 3.8371 1.0188 1.0016 3.8528 0.9925 3.5999 1.0755 0.9810 4.3688 2.1716 2.2430 1.0564 0.9976
dispcorr: -0.082257080 hartree
energy: -1406.336190663193
dipole: 7.06387 -4.25550 2.80837 -8.77199 6.85648 -1.91551 2.16276 -1.94246 0.22030
magnitude: 3.40656 au
magnitude: 8.65878 debye
zeropoint: 0.31053590 hartree
thermalvibcorrection: 0.01826567 hartree
thermalrotcorrection: 0.00141627 hartree
thermaltrasncorrection: 0.00141627 hartree
thermaltotal: -1406.00455656 hartree
thermalcorr: 0.02109821 hartree
nonthermalcorr: 0.31053590 hartree
totalcorr: 0.33163411 hartree
totalenthalpy: -1406.00361235 hartree
