program: Gaussian 09
title: 000048544
version: EM64L-G09RevD.01
frameworkgroup: C1[X(C11H16N2O3S)]
method: RPBEPBE
basis: SDD
operation: Freq
keyword: #p
keyword: freq=noraman
keyword: PBEPBE/SDD
title: #p freq=noraman PBEPBE/SDD
converged: YES YES NO NO
title: Mulliken charges:
elementType: S O O O N N C C C C C C C C C C C H H H H H H H H H H H H H H H H
charge: 0.194636 -0.185711 -0.211551 -0.220517 -0.372539 -0.377681 0.091817 -0.446596 -0.528495 0.190987 0.159941 -0.687346 -0.052956 0.148375 -0.574478 -0.657716 -0.580185 0.275058 0.237568 0.251077 0.245814 0.229866 0.261479 0.366832 0.365366 0.245127 0.243886 0.253789 0.231135 0.234077 0.221929 0.214298 0.232715
chargesum: 0.00000
title: Mulliken charges with hydrogens summed into heavy atoms:
elementType: S O O O N N C C C C C C C C C C C
charge: 0.194636 -0.185711 -0.211551 -0.220517 -0.005706 -0.012315 0.091817 -0.171538 -0.039850 0.190987 0.159941 0.049812 0.192170 0.148375 -0.076803 0.029424 -0.133173
polarizability: 1.72811734e+02 5.18164670e-01 1.55750634e+02 -3.66053664e+00 5.64638326e+00 1.48193195e+02
1716.lowfreq: -10.4984 -4.3713 -0.0024 -0.0020 -0.0018 14.6677 30.5365 36.4539 48.3696
frequency: 30.4334 34.6573 48.3058 64.9798 68.6404 80.3508 108.3391 145.4572 151.8518 163.4855 168.6496 185.0731 225.4772 240.4809 241.1817 261.2585 297.2087 325.9533 352.3667 359.4743 373.4608 394.5667 437.7271 485.4361 509.9721 589.0539 605.1357 622.3012 627.4592 634.6198 653.3801 683.9535 709.8516 746.7605 770.3481 779.5119 792.4760 838.0560 908.5463 953.2260 955.4529 987.5742 988.8583 994.8483 998.9883 1017.4617 1031.0894 1056.2542 1065.5759 1086.8457 1118.1141 1146.2083 1184.0108 1227.9201 1244.2048 1269.3445 1277.5024 1289.1785 1293.4128 1306.4357 1324.9030 1359.3428 1374.2516 1376.4006 1397.7409 1403.3916 1424.6921 1445.9241 1458.5389 1469.4702 1472.4450 1480.6209 1483.7907 1618.3494 1658.1379 1661.0595 1675.0716 2987.2863 2994.4045 2999.6840 3007.8324 3026.5862 3072.8550 3081.2840 3084.9957 3085.8829 3091.7582 3101.6599 3103.1955 3109.7551 3200.6628 3520.2673 3524.0172
redmass: 4.6965 4.0303 4.2615 2.6974 2.3848 3.8530 4.4737 5.9879 3.9929 5.4178 5.4392 6.5197 2.1798 1.1289 1.3610 3.3949 3.0111 4.2198 6.0182 10.2539 4.1430 2.2172 3.1401 8.9347 4.6167 4.0176 4.6047 3.7974 2.9606 3.2967 3.0801 2.7557 2.9321 2.1596 3.3171 1.8129 1.1161 2.0884 2.8418 1.8304 1.4869 2.1224 2.7044 1.8301 2.0869 1.2012 1.2181 1.9319 2.0634 3.1757 2.7567 2.5982 4.5735 1.2752 1.2310 1.3427 1.3045 1.5890 1.8585 1.3079 1.4752 9.6123 1.8624 1.5453 1.2014 1.1928 1.1536 1.1160 1.0838 1.0397 1.0482 1.0461 1.0475 7.2210 7.9733 5.0015 5.6003 1.0356 1.0400 1.0787 1.0593 1.0586 1.1044 1.0992 1.0840 1.0963 1.0781 1.1029 1.1000 1.0958 1.1150 1.0764 1.0776
irintensity: 0.1937 1.1639 0.9868 0.1495 0.4491 0.1783 0.8262 0.9602 5.4343 7.2118 0.6708 0.9915 0.3652 0.1780 0.2341 1.2408 0.6486 3.4906 9.1217 21.9619 7.8518 1.1954 2.8739 12.7031 22.3054 6.2638 3.1111 9.9011 8.0270 16.9770 5.7268 28.5819 5.5947 23.0654 2.0190 197.5066 9.3087 4.9670 3.0717 24.6636 60.5390 3.6189 4.7400 20.5250 6.6845 27.2934 0.3348 16.9564 0.3168 5.0615 67.9940 12.0747 23.6891 23.3448 6.3159 6.9787 38.3276 78.4877 138.4416 20.9060 58.1539 230.5233 2.5736 6.9397 16.0530 30.5729 6.1466 30.2858 4.7853 14.6889 14.8313 7.5485 9.1492 264.0110 80.3083 41.7110 585.3421 32.8592 13.6141 21.0866 17.6732 10.0413 2.7737 25.0353 3.2289 11.2554 7.9542 47.9778 12.4014 12.8536 23.3992 78.9493 53.8025
temp: 298.150 k
press: 1.00000 atm
elementType: 16 8 8 8 7 7 6 6 6 6 6 6 6 6 6 6 6 1 1 1 1 1 1 1 1 1 1 1 1 1 1 1 1
symmnumber: 1
zpe: 683576.1 jmol-1
zpe.correction: 0.260360 hartree
zpe.thermalcorrener: 0.279095 hartree
zpe.thermalcorrenthalpy: 0.280040 hartree
zpe.thermalcorrgfe: 0.212297 hartree
zpe.sumelectzpe: -1160.724985 hartree
zpe.sumelectthermal: -1160.706250 hartree
zpe.sumelectthermalent: -1160.705306 hartree
zpe.sumelectthermalfe: -1160.773049 hartree
dipole: 2.4119 0.7630 1.6916
dipole: 3.0432
quadrupole: -100.5919 -119.6161 -113.1732
quadrupole: 4.6742 5.1732 1.5343
quadrupole: 10.5352 -8.4891 -2.0461 4.6742 5.1732 1.5343
hfenergy: -1160.9853458 hartree
pointgroup: C01 [X(C11H16N2O3S1)]
dipole: -0.849518 0.6090467 -0.5838587 debye
polarizability: 171.857099|-3.3116812|158.1303413|-5.1434198|-3.0565213|146.7681233 unknown
InChI: InChI=1S/C11H16N2O3S/c1-4-6-11(7(3)17-5-2)8(14)12-10(16)13-9(11)15/h4,7,12-13H,1,5-6H2,2-3H3
charge 0 multiplicity 1
33 atoms
S  -2.620992 -0.158933 0.378987
O  -0.08338 -1.012009 2.11065
O  1.673529 -0.249858 -2.243645
O  2.243508 2.883623 1.137697
N  0.925046 0.998585 1.571633
N  1.855948 1.336333 -0.572281
C  0.159578 -0.485694 -0.298062
C  -1.158628 0.273804 -0.786118
C  0.09902 -2.020566 -0.563138
C  0.319981 -0.23053 1.219802
C  1.298896 0.163301 -1.116528
C  -1.526748 -0.005087 -2.254574
C  1.408791 -2.734539 -0.280017
C  1.699202 1.823571 0.741933
C  -3.844481 1.172541 -0.208382
C  -5.002663 1.254823 0.797171
C  1.616332 -3.577843 0.761167
H  -0.992266 1.35882 -0.636419
H  -0.166355 -2.169699 -1.624108
H  -0.708404 -2.43681 0.062897
H  -1.91339 -1.030104 -2.378686
H  -2.317762 0.692521 -2.580158
H  -0.66026 0.126841 -2.927308
H  0.902836 1.258482 2.563075
H  2.517112 1.855239 -1.159691
H  2.218698 -2.550293 -1.000827
H  -3.295391 2.129868 -0.264967
H  -4.207854 0.901547 -1.213748
H  -5.531928 0.288729 0.879476
H  -4.639785 1.534187 1.801541
H  -5.734586 2.015864 0.46898
H  2.579661 -4.080991 0.904778
H  0.833236 -3.776322 1.502469
