program: Orca
programVersion: 5.0.2
elementType: N H C H C O C C O N H C H H H O H H S H C O C H H C H H C H N H H C O O H H
charge: 1
multiplicity: 1
keywords: wB97X-D3BJ Opt Freq def2-TZVPP def2/J RIJCOSX VeryTightSCF
keywords: PAL8 defgrid3 TightOpt
frequency: 0.00 0.00 0.00 0.00 0.00 0.00 20.89 27.66 36.58 46.60 52.56 76.64 87.88 94.42 122.75 130.25 141.80 175.24 192.96 223.25 243.51 263.20 266.77 286.07 302.46 319.23 326.98 341.53 353.60 375.49 399.20 442.76 467.89 524.14 532.15 569.51 590.03 600.11 606.63 613.32 631.57 664.02 689.24 718.41 751.40 759.89 768.68 801.90 814.71 827.54 895.12 904.35 922.80 931.76 998.72 1008.29 1027.83 1035.01 1043.99 1077.67 1100.85 1134.41 1142.12 1146.57 1160.28 1194.27 1218.96 1222.44 1257.44 1261.70 1272.35 1295.09 1312.73 1331.42 1350.51 1351.05 1362.69 1388.41 1399.51 1406.14 1422.30 1441.33 1447.51 1466.20 1474.62 1499.95 1502.69 1539.23 1555.90 1578.76 1656.95 1683.02 1754.20 1768.94 1814.93 1883.51 2769.21 2978.04 3069.09 3091.31 3102.36 3113.43 3117.20 3126.96 3145.57 3148.38 3165.39 3178.83 3497.95 3553.81 3581.49 3588.04 3781.93 3840.07
frequency: 20.89 27.66 36.58 46.60 52.56 76.64 87.88 94.42 122.75 130.25 141.80 175.24 192.96 223.25 243.51 263.20 266.77 286.07 302.46 319.23 326.98 341.53 353.60 375.49 399.20 442.76 467.89 524.14 532.15 569.51 590.03 600.11 606.63 613.32 631.57 664.02 689.24 718.41 751.40 759.89 768.68 801.90 814.71 827.54 895.12 904.35 922.80 931.76 998.72 1008.29 1027.83 1035.01 1043.99 1077.67 1100.85 1134.41 1142.12 1146.57 1160.28 1194.27 1218.96 1222.44 1257.44 1261.70 1272.35 1295.09 1312.73 1331.42 1350.51 1351.05 1362.69 1388.41 1399.51 1406.14 1422.30 1441.33 1447.51 1466.20 1474.62 1499.95 1502.69 1539.23 1555.90 1578.76 1656.95 1683.02 1754.20 1768.94 1814.93 1883.51 2769.21 2978.04 3069.09 3091.31 3102.36 3113.43 3117.20 3126.96 3145.57 3148.38 3165.39 3178.83 3497.95 3553.81 3581.49 3588.04 3781.93 3840.07
formula: C10H18N3O6S
InChI: InChI=1S/C10H18N3O6S/c11-5(10(18)19)1-2-7(14)13-6(4-20)9(17)12-3-8(15)16/h5-6,12-13,15,18,20H,1-4H2,11H3
38 atoms
N  0.454584 2.558341 1.797501
H  1.214135 2.522363 1.130198
C  0.710924 2.945333 3.158344
H  1.641366 3.514128 3.203264
C  0.870756 1.732764 4.066826
O  1.464522 0.735126 3.711202
C  -0.609031 1.751495 1.564168
C  -0.754984 1.265074 0.114439
O  -1.3656 1.422639 2.468344
N  -0.070957 -0.008672 -0.022077
H  -0.261399 1.987625 -0.539151
C  -2.21831 1.143697 -0.312488
H  -0.645736 -0.840879 -0.009593
H  -2.754443 2.053128 -0.046238
H  -2.255517 1.044735 -1.397808
O  0.389842 1.803462 5.298596
H  -0.133118 2.602126 5.432732
H  -0.097019 3.581246 3.526428
S  -3.103652 -0.302654 0.320502
H  -3.106349 0.075838 1.602585
C  1.279791 -0.093879 0.017369
O  2.002099 0.891307 0.060908
C  1.84464 -1.498119 0.118815
H  1.188296 -2.233289 -0.344618
H  2.803401 -1.505117 -0.397288
C  2.088351 -1.830907 1.598047
H  2.712095 -1.043259 2.028484
H  2.632687 -2.776648 1.677639
C  0.801762 -1.918391 2.433084
H  0.171712 -1.045192 2.263484
N  1.159342 -1.880747 3.890158
H  0.379758 -2.182385 4.47321
H  1.949429 -2.489625 4.098305
C  -0.02263 -3.144744 2.085854
O  -0.557198 -3.281636 1.025794
O  -0.065362 -4.036237 3.092113
H  -0.597977 -4.795186 2.812486
H  1.392516 -0.880841 4.111017
totalener: -1406.24121643 hartree
nucrepener: 1965.96732848 hartree
electener: -3372.20854491 hartree
oneelecener: -5815.86826855 hartree
twoeener: 2443.65972363 hartree
kineticenergy: 1400.67251186 hartree
exchangeener: -105.328780350155 hartree
correlationener: -7.059124932363 hartree
xcener: -112.387905282519 hartree
temp: 298.15 k
press: 1.00 atm
thermalcorrenthalpy: 0.00094421 hartree
totalenthalpy: -1405.99594068 hartree
totalentropycorr: -0.06467630 hartree
gibbsenthalpy: -1406.06061698 hartree
gibbsminuselec: 0.26507633 hartree
chargesum: 1.0000000
charge: -0.165320 0.209142 -0.113039 0.145873 0.390211 -0.399934 0.222566 0.056968 -0.417748 -0.206905 0.135920 -0.175953 0.181551 0.124476 0.147737 -0.212492 0.242382 0.115310 -0.161921 0.125006 0.276704 -0.403501 -0.196719 0.128525 0.135425 -0.203273 0.139268 0.129708 0.011369 0.097732 -0.059706 0.225527 0.227420 0.312008 -0.265928 -0.290671 0.255987 0.236295
charge: 0.335127 -0.025518 -0.047234 0.045857 -0.402126 0.148766 -0.369482 -0.134749 0.074179 0.335978 0.041080 -0.227246 -0.043158 0.014945 0.017512 0.411114 -0.077488 0.032982 0.490356 -0.151919 -0.384608 0.081846 0.009412 0.028552 0.043758 0.002435 0.038671 0.032139 -0.053489 0.040581 0.608393 0.045231 0.048468 -0.433912 0.165150 0.358373 -0.066089 -0.033889
qa: -0.1653 0.2091 -0.1130 0.1459 0.3902 -0.3999 0.2226 0.0570 -0.4177 -0.2069 0.1359 -0.1760 0.1816 0.1245 0.1477 -0.2125 0.2424 0.1153 -0.1619 0.1250 0.2767 -0.4035 -0.1967 0.1285 0.1354 -0.2033 0.1393 0.1297 0.0114 0.0977 -0.0597 0.2255 0.2274 0.3120 -0.2659 -0.2907 0.2560 0.2363
va: 3.2027 1.0271 3.9573 0.9970 4.1076 2.1255 4.1534 3.8713 2.0842 3.1243 1.0096 3.9565 1.0526 1.0071 0.9952 2.2793 1.0079 1.0121 2.1733 1.0296 4.1732 2.1134 3.9231 1.0210 1.0197 3.9060 1.0233 0.9996 3.7859 1.0839 3.6055 0.9871 0.9814 4.3269 2.2123 2.2155 1.0075 1.0701
dispcorr: -0.083420690 hartree
energy: -1406.332225524538
dipole: 5.63204 -4.30360 1.32843 -0.19688 -0.73484 -0.93172 1.41255 1.36978 2.78233
magnitude: 3.22090 au
magnitude: 8.18688 debye
zeropoint: 0.31159642 hartree
thermalvibcorrection: 0.01823214 hartree
thermalrotcorrection: 0.00141627 hartree
thermaltrasncorrection: 0.00141627 hartree
thermaltotal: -1405.99956442 hartree
thermalcorr: 0.02106469 hartree
nonthermalcorr: 0.31159642 hartree
totalcorr: 0.33266111 hartree
totalenthalpy: -1405.99862021 hartree
