program: Orca
programVersion: 5.0.2
elementType: N H C H C O C C O N H C H H H O H H S H C O C H H C H H C H N H H C O O H H
charge: 1
multiplicity: 1
keywords: wB97X-D3BJ Opt Freq def2-TZVPP def2/J RIJCOSX VeryTightSCF
keywords: PAL8 defgrid3 TightOpt
frequency: 0.00 0.00 0.00 0.00 0.00 0.00 10.98 15.27 23.40 33.35 40.76 50.10 52.74 63.47 84.55 86.85 110.46 134.53 156.31 188.88 234.94 245.19 273.84 287.42 293.77 316.79 325.77 348.23 414.57 418.45 437.88 486.51 499.86 508.01 508.73 536.08 576.96 597.42 608.84 623.88 654.67 670.37 679.60 710.53 737.97 745.92 756.63 780.28 845.84 865.11 868.62 881.55 936.85 954.30 967.60 986.36 1011.76 1027.74 1057.29 1069.67 1109.77 1131.78 1163.22 1169.65 1191.93 1197.33 1209.53 1212.39 1230.66 1263.26 1276.86 1297.71 1303.81 1318.64 1335.32 1357.95 1362.87 1371.87 1388.64 1398.33 1410.74 1438.25 1459.50 1461.43 1475.47 1493.05 1495.41 1571.44 1589.08 1599.75 1611.67 1681.62 1718.89 1790.93 1853.82 1878.32 2204.55 2766.43 3076.36 3094.69 3098.30 3116.77 3118.83 3121.40 3137.73 3152.40 3176.23 3181.78 3417.33 3536.37 3571.52 3682.63 3783.90 3806.38
frequency: 10.98 15.27 23.40 33.35 40.76 50.10 52.74 63.47 84.55 86.85 110.46 134.53 156.31 188.88 234.94 245.19 273.84 287.42 293.77 316.79 325.77 348.23 414.57 418.45 437.88 486.51 499.86 508.01 508.73 536.08 576.96 597.42 608.84 623.88 654.67 670.37 679.60 710.53 737.97 745.92 756.63 780.28 845.84 865.11 868.62 881.55 936.85 954.30 967.60 986.36 1011.76 1027.74 1057.29 1069.67 1109.77 1131.78 1163.22 1169.65 1191.93 1197.33 1209.53 1212.39 1230.66 1263.26 1276.86 1297.71 1303.81 1318.64 1335.32 1357.95 1362.87 1371.87 1388.64 1398.33 1410.74 1438.25 1459.50 1461.43 1475.47 1493.05 1495.41 1571.44 1589.08 1599.75 1611.67 1681.62 1718.89 1790.93 1853.82 1878.32 2204.55 2766.43 3076.36 3094.69 3098.30 3116.77 3118.83 3121.40 3137.73 3152.40 3176.23 3181.78 3417.33 3536.37 3571.52 3682.63 3783.90 3806.38
formula: C10H18N3O6S
InChI: InChI=1S/C10H18N3O6S/c11-5(10(18)19)1-2-7(14)13-6(4-20)9(17)12-3-8(15)16/h5-6,12-13,15,18,20H,1-4H2,11H3
38 atoms
N  -3.266091 1.591506 -0.05752
H  -3.003987 2.561702 -0.061573
C  -4.656406 1.257953 -0.278358
H  -4.862118 0.27093 0.130916
C  -5.081781 1.238889 -1.739481
O  -6.128161 0.793176 -2.111066
C  -2.306404 0.658365 -0.213751
C  -0.860273 1.182017 -0.209058
O  -2.531894 -0.531343 -0.344882
N  -0.036775 -0.007237 -0.09058
H  -0.707258 1.824891 0.661435
C  -0.54657 1.994896 -1.474624
H  -0.565686 -0.867234 -0.197666
H  -1.341098 2.721936 -1.638807
H  0.395068 2.520358 -1.337289
O  -4.170549 1.802786 -2.557655
H  -4.521943 1.739485 -3.455772
H  -5.291704 1.975434 0.241965
S  -0.434639 0.882891 -2.905602
H  -0.204168 1.843434 -3.806111
C  1.283707 -0.006415 -0.036584
O  1.934575 1.052852 0.075186
C  1.960247 -1.357471 -0.151781
H  1.282441 -2.127545 0.218469
H  2.080078 -1.554052 -1.222579
C  3.298024 -1.479696 0.588614
H  3.525612 -2.538749 0.708332
H  3.213888 -1.063203 1.595257
C  4.515154 -0.852769 -0.100136
H  5.416602 -1.14312 0.443126
N  4.441271 0.636948 -0.140222
H  4.802164 0.951871 -1.046581
H  3.382222 0.92233 -0.051177
C  4.699878 -1.307728 -1.545214
O  4.852833 -0.533553 -2.452497
O  4.684501 -2.630441 -1.651408
H  4.839107 -2.875819 -2.575402
H  4.973907 1.067981 0.60939
totalener: -1406.25182279 hartree
nucrepener: 1782.30075110 hartree
electener: -3188.55257389 hartree
oneelecener: -5449.62772546 hartree
twoeener: 2261.07515157 hartree
kineticenergy: 1400.65248012 hartree
exchangeener: -105.325476012007 hartree
correlationener: -7.051590378036 hartree
xcener: -112.377066390044 hartree
temp: 298.15 k
press: 1.00 atm
thermalcorrenthalpy: 0.00094421 hartree
totalenthalpy: -1406.00112396 hartree
totalentropycorr: -0.06655401 hartree
gibbsenthalpy: -1406.06767797 hartree
gibbsminuselec: 0.26085970 hartree
chargesum: 1.0000000
charge: -0.199425 0.176470 -0.070160 0.141601 0.287162 -0.279432 0.284218 0.018520 -0.373758 -0.174775 0.137625 -0.174963 0.198167 0.113524 0.142545 -0.279823 0.232209 0.130408 -0.161931 0.114935 0.286859 -0.427494 -0.153421 0.133489 0.121813 -0.202504 0.145904 0.133884 -0.018507 0.151590 -0.083504 0.215761 0.215377 0.283108 -0.290799 -0.248777 0.257637 0.216462
charge: 0.334098 -0.021003 -0.031720 0.045285 -0.436019 0.136598 -0.379640 -0.121063 0.104535 0.366848 0.039496 -0.228087 -0.018179 0.002316 -0.000353 0.348803 -0.084959 0.038478 0.476743 -0.145279 -0.335765 0.159382 0.001777 0.042896 0.042859 0.002563 0.045130 0.036487 -0.058337 0.046747 0.588712 0.022538 -0.093416 -0.439786 0.142654 0.401895 -0.063390 0.030159
qa: -0.1994 0.1765 -0.0702 0.1416 0.2872 -0.2794 0.2842 0.0185 -0.3738 -0.1748 0.1376 -0.1750 0.1982 0.1135 0.1425 -0.2798 0.2322 0.1304 -0.1619 0.1149 0.2869 -0.4275 -0.1534 0.1335 0.1218 -0.2025 0.1459 0.1339 -0.0185 0.1516 -0.0835 0.2158 0.2154 0.2831 -0.2908 -0.2488 0.2576 0.2165
va: 3.2282 1.0159 3.8013 1.0235 4.3121 2.2316 4.2292 3.9154 2.1457 3.3064 1.0053 3.9589 1.0418 1.0197 1.0075 2.1698 1.0239 1.0003 2.1504 1.0196 4.1345 2.0946 3.8108 1.0051 1.0197 3.8875 1.0091 1.0051 3.9317 1.0012 3.5163 1.0181 1.1207 4.3430 2.1990 2.2645 1.0028 0.9847
dispcorr: -0.077905121 hartree
energy: -1406.333891242500
dipole: 11.40053 -6.16440 5.23613 1.38021 -0.90895 0.47126 7.14609 -5.46922 1.67687
magnitude: 5.51824 au
magnitude: 14.02626 debye
zeropoint: 0.30907432 hartree
thermalvibcorrection: 0.01883787 hartree
thermalrotcorrection: 0.00141627 hartree
thermaltrasncorrection: 0.00141627 hartree
thermaltotal: -1406.00314650 hartree
thermalcorr: 0.02167042 hartree
nonthermalcorr: 0.30907432 hartree
totalcorr: 0.33074474 hartree
totalenthalpy: -1406.00220229 hartree
