program: Orca
programVersion: 5.0.2
elementType: N H C H C O C C O N H C H H H O H H S H C O C H H C H H C H N H H C O O H H
charge: 1
multiplicity: 1
keywords: wB97X-D3BJ Opt Freq def2-TZVPP def2/J RIJCOSX VeryTightSCF
keywords: PAL8 defgrid3 TightOpt
frequency: 0.00 0.00 0.00 0.00 0.00 0.00 23.27 32.63 47.60 53.12 64.45 68.03 85.67 108.05 118.04 121.78 149.47 172.71 190.05 209.91 225.37 230.05 259.70 280.35 296.67 305.70 323.53 336.62 349.56 377.73 398.42 440.92 491.05 510.55 522.07 554.77 580.57 593.41 599.56 647.19 661.61 662.08 682.43 695.07 706.95 729.56 744.85 799.33 828.93 855.16 879.81 896.62 908.95 944.81 972.02 1021.76 1024.90 1056.03 1064.95 1102.61 1114.39 1129.66 1133.84 1166.80 1185.07 1204.68 1212.23 1226.87 1242.41 1269.79 1289.50 1296.30 1314.19 1316.99 1324.57 1346.01 1359.08 1376.70 1390.71 1420.79 1434.54 1453.59 1456.65 1471.49 1474.59 1486.11 1496.01 1533.39 1574.26 1605.46 1634.14 1689.64 1740.24 1756.22 1829.37 1851.56 2750.97 3087.12 3087.22 3095.25 3095.58 3134.69 3139.23 3145.59 3156.18 3158.16 3165.91 3177.93 3335.25 3447.07 3600.44 3653.22 3790.81 3798.68
frequency: 23.27 32.63 47.60 53.12 64.45 68.03 85.67 108.05 118.04 121.78 149.47 172.71 190.05 209.91 225.37 230.05 259.70 280.35 296.67 305.70 323.53 336.62 349.56 377.73 398.42 440.92 491.05 510.55 522.07 554.77 580.57 593.41 599.56 647.19 661.61 662.08 682.43 695.07 706.95 729.56 744.85 799.33 828.93 855.16 879.81 896.62 908.95 944.81 972.02 1021.76 1024.90 1056.03 1064.95 1102.61 1114.39 1129.66 1133.84 1166.80 1185.07 1204.68 1212.23 1226.87 1242.41 1269.79 1289.50 1296.30 1314.19 1316.99 1324.57 1346.01 1359.08 1376.70 1390.71 1420.79 1434.54 1453.59 1456.65 1471.49 1474.59 1486.11 1496.01 1533.39 1574.26 1605.46 1634.14 1689.64 1740.24 1756.22 1829.37 1851.56 2750.97 3087.12 3087.22 3095.25 3095.58 3134.69 3139.23 3145.59 3156.18 3158.16 3165.91 3177.93 3335.25 3447.07 3600.44 3653.22 3790.81 3798.68
formula: C10H18N3O6S
InChI: InChI=1S/C10H18N3O6S/c11-5(10(18)19)1-2-7(14)13-6(4-20)9(17)12-3-8(15)16/h5-6,12-13,15,18,20H,1-4H2,11H3
38 atoms
N  -0.715143 2.305297 2.790572
H  -1.298911 2.970729 2.305474
C  -0.579935 2.407935 4.222752
H  -1.226195 3.203062 4.591187
C  0.837243 2.678316 4.69225
O  1.845671 2.52616 4.04335
C  -0.303169 1.215054 2.122163
C  -0.647451 1.164217 0.614108
O  0.312563 0.30406 2.661681
N  0.050709 0.027505 0.043405
H  -0.259971 2.065805 0.14074
C  -2.152262 1.045744 0.343158
H  -0.36278 -0.875689 0.210701
H  -2.300585 0.718017 -0.684733
H  -2.606565 0.29693 0.995739
O  0.837909 3.086372 5.958072
H  1.7522 3.217217 6.245176
H  -0.891875 1.47848 4.708416
S  -3.08541 2.571544 0.615447
H  -2.649014 3.218943 -0.471917
C  1.402034 0.070598 0.020754
O  2.005076 1.142036 0.054586
C  2.141951 -1.250256 -0.006219
H  1.500074 -2.048579 0.371449
H  2.37991 -1.48919 -1.045828
C  3.442767 -1.194762 0.803451
H  4.170732 -0.546977 0.309767
H  3.870199 -2.197016 0.821621
C  3.264843 -0.725965 2.25971
H  2.317324 -1.079791 2.665564
N  3.280447 0.76467 2.36205
H  3.023125 1.168336 1.44236
H  2.599018 1.136928 3.038574
C  4.405334 -1.220372 3.139476
O  5.236131 -0.485523 3.605697
O  4.366151 -2.538431 3.303602
H  5.117943 -2.808063 3.850345
H  4.215094 1.056968 2.661949
totalener: -1406.26706396 hartree
nucrepener: 1867.82267206 hartree
electener: -3274.08973603 hartree
oneelecener: -5619.99353170 hartree
twoeener: 2345.90379568 hartree
kineticenergy: 1400.69447118 hartree
exchangeener: -105.335532792559 hartree
correlationener: -7.056123154670 hartree
xcener: -112.391655947229 hartree
temp: 298.15 k
press: 1.00 atm
thermalcorrenthalpy: 0.00094421 hartree
totalenthalpy: -1406.01747726 hartree
totalentropycorr: -0.06527572 hartree
gibbsenthalpy: -1406.08275298 hartree
gibbsminuselec: 0.26446279 hartree
chargesum: 1.0000000
charge: -0.175297 0.176879 -0.080892 0.150099 0.342143 -0.375072 0.239287 0.067843 -0.445557 -0.171520 0.129859 -0.185350 0.170350 0.147262 0.130592 -0.236287 0.243697 0.136421 -0.130865 0.116563 0.254529 -0.407733 -0.163562 0.103918 0.132479 -0.217269 0.133294 0.128437 0.038115 0.148704 -0.076635 0.223434 0.244348 0.285951 -0.299503 -0.247776 0.250910 0.218202
charge: 0.338163 -0.050927 -0.035429 0.043092 -0.411708 0.107920 -0.374645 -0.135072 0.059099 0.339169 0.037405 -0.236700 -0.012886 0.013480 0.014700 0.394906 -0.074672 0.044495 0.519913 -0.141204 -0.352860 0.109963 -0.000234 0.031815 0.045351 0.006973 0.036091 0.038989 -0.048126 0.042973 0.612077 -0.021910 0.000964 -0.433494 0.134944 0.395185 -0.067411 0.029610
qa: -0.1753 0.1769 -0.0809 0.1501 0.3421 -0.3751 0.2393 0.0678 -0.4456 -0.1715 0.1299 -0.1853 0.1704 0.1473 0.1306 -0.2363 0.2437 0.1364 -0.1309 0.1166 0.2545 -0.4077 -0.1636 0.1039 0.1325 -0.2173 0.1333 0.1284 0.0381 0.1487 -0.0766 0.2234 0.2443 0.2860 -0.2995 -0.2478 0.2509 0.2182
va: 3.1608 1.0651 3.8177 1.0076 4.2545 2.1017 4.2423 3.7653 2.0592 3.2608 1.0300 3.9476 1.0239 0.9983 0.9964 2.2620 1.0144 1.0122 2.1932 1.0195 4.2002 2.0887 3.8696 1.0154 1.0061 3.8818 1.0089 1.0230 3.7724 1.0265 3.6048 1.0561 1.0357 4.3644 2.1933 2.2599 1.0077 1.0137
dispcorr: -0.080562102 hartree
energy: -1406.353102628934
dipole: 0.16684 0.22674 0.39358 -4.86757 3.95535 -0.91222 -5.71414 5.76356 0.04941
magnitude: 0.99473 au
magnitude: 2.52841 debye
zeropoint: 0.31127561 hartree
thermalvibcorrection: 0.01834178 hartree
thermalrotcorrection: 0.00141627 hartree
thermaltrasncorrection: 0.00141627 hartree
thermaltotal: -1406.02065269 hartree
thermalcorr: 0.02117433 hartree
nonthermalcorr: 0.31127561 hartree
totalcorr: 0.33244994 hartree
totalenthalpy: -1406.01970848 hartree
