program: Orca
programVersion: 5.0.2
elementType: N H C H C O C C O N H C H H H O H H S H C O C H H C H H C H N H H C O O H H
charge: 1
multiplicity: 1
keywords: wB97X-D3BJ Opt Freq def2-TZVPP def2/J RIJCOSX VeryTightSCF
keywords: PAL8 defgrid3 TightOpt
frequency: 0.00 0.00 0.00 0.00 0.00 0.00 20.66 28.48 31.39 40.29 51.35 60.34 69.95 83.64 106.48 116.34 143.56 185.03 208.46 223.35 240.50 263.65 289.02 295.54 310.89 335.70 349.24 382.61 390.72 410.50 429.05 462.70 499.43 515.34 529.27 539.17 586.32 592.28 603.57 622.60 648.82 662.90 689.83 697.75 705.36 724.61 749.38 762.78 805.92 827.45 856.50 885.69 898.78 920.51 971.70 978.56 1010.08 1020.38 1038.75 1065.48 1123.37 1145.34 1158.60 1168.96 1172.33 1201.11 1205.35 1236.86 1249.68 1281.12 1297.24 1308.62 1326.95 1338.20 1340.11 1353.21 1359.25 1374.23 1400.97 1425.53 1433.62 1450.99 1454.70 1464.18 1478.72 1481.53 1490.34 1525.87 1532.17 1617.76 1648.61 1680.95 1709.91 1804.55 1833.93 1888.84 2332.45 2765.31 3064.64 3084.04 3095.03 3107.50 3115.19 3137.70 3143.18 3150.21 3156.06 3198.91 3503.19 3536.86 3575.92 3638.25 3787.60 3796.95
frequency: 20.66 28.48 31.39 40.29 51.35 60.34 69.95 83.64 106.48 116.34 143.56 185.03 208.46 223.35 240.50 263.65 289.02 295.54 310.89 335.70 349.24 382.61 390.72 410.50 429.05 462.70 499.43 515.34 529.27 539.17 586.32 592.28 603.57 622.60 648.82 662.90 689.83 697.75 705.36 724.61 749.38 762.78 805.92 827.45 856.50 885.69 898.78 920.51 971.70 978.56 1010.08 1020.38 1038.75 1065.48 1123.37 1145.34 1158.60 1168.96 1172.33 1201.11 1205.35 1236.86 1249.68 1281.12 1297.24 1308.62 1326.95 1338.20 1340.11 1353.21 1359.25 1374.23 1400.97 1425.53 1433.62 1450.99 1454.70 1464.18 1478.72 1481.53 1490.34 1525.87 1532.17 1617.76 1648.61 1680.95 1709.91 1804.55 1833.93 1888.84 2332.45 2765.31 3064.64 3084.04 3095.03 3107.50 3115.19 3137.70 3143.18 3150.21 3156.06 3198.91 3503.19 3536.86 3575.92 3638.25 3787.60 3796.95
formula: C10H18N3O6S
InChI: InChI=1S/C10H18N3O6S/c11-5(10(18)19)1-2-7(14)13-6(4-20)9(17)12-3-8(15)16/h5-6,12-13,15,18,20H,1-4H2,11H3
38 atoms
N  -2.728049 0.042293 1.585636
H  -3.691521 -0.256567 1.587569
C  -1.927595 -0.301277 2.731082
H  -1.079476 0.37811 2.835329
C  -1.362738 -1.716686 2.671469
O  -1.11035 -2.319006 1.656612
C  -2.394781 0.750886 0.470161
C  -0.929295 1.195851 0.311094
O  -3.221303 1.00715 -0.378128
N  -0.113609 -0.014841 0.256126
H  -0.639237 1.791059 1.183953
C  -0.784999 2.089853 -0.92836
H  -0.588742 -0.907437 0.323574
H  -1.621366 2.783895 -0.950915
H  0.136805 2.660548 -0.858944
O  -1.148646 -2.201766 3.893857
H  -0.773377 -3.089681 3.813782
H  -2.518107 -0.199567 3.641702
S  -0.695883 1.208795 -2.500204
H  -1.968022 0.797548 -2.527908
C  1.16222 -0.030154 -0.111611
O  1.834111 1.017753 -0.177563
C  1.707612 -1.396622 -0.472071
H  1.497165 -2.077445 0.356494
H  1.114108 -1.76054 -1.31337
C  3.196438 -1.481313 -0.815148
H  3.412219 -2.52327 -1.050303
H  3.810235 -1.226745 0.053531
C  3.686588 -0.645074 -2.006803
H  4.631028 -1.05653 -2.36917
N  3.93518 0.769448 -1.585217
H  3.08686 1.024206 -0.94444
H  4.799961 0.847977 -1.056666
C  2.723135 -0.69156 -3.1908
O  2.186107 -1.697926 -3.542614
O  2.592486 0.506139 -3.780448
H  1.947162 0.437202 -4.498821
H  3.972648 1.39453 -2.388385
totalener: -1406.23697054 hartree
nucrepener: 1921.55590527 hartree
electener: -3327.79287581 hartree
oneelecener: -5727.12700160 hartree
twoeener: 2399.33412579 hartree
kineticenergy: 1400.65056261 hartree
exchangeener: -105.323615966641 hartree
correlationener: -7.058595885729 hartree
xcener: -112.382211852370 hartree
temp: 298.15 k
press: 1.00 atm
thermalcorrenthalpy: 0.00094421 hartree
totalenthalpy: -1405.99216263 hartree
totalentropycorr: -0.06482926 hartree
gibbsenthalpy: -1406.05699189 hartree
gibbsminuselec: 0.26326788 hartree
chargesum: 1.0000000
charge: -0.195249 0.196418 -0.100231 0.121555 0.308680 -0.346318 0.213230 0.033748 -0.330113 -0.166606 0.118910 -0.147859 0.202140 0.149368 0.136109 -0.242122 0.243436 0.163083 -0.218014 0.141818 0.237921 -0.423028 -0.154254 0.144454 0.150519 -0.226742 0.141750 0.114705 -0.006847 0.151876 -0.075912 0.223803 0.213800 0.278352 -0.247508 -0.282273 0.258544 0.218861
charge: 0.329713 -0.003830 -0.051778 0.038211 -0.432567 0.110944 -0.380380 -0.122029 0.111884 0.356141 0.033580 -0.235756 -0.026318 0.016463 0.002424 0.386778 -0.076541 0.041266 0.472881 -0.139109 -0.342385 0.163090 -0.003621 0.043655 0.044781 0.006112 0.048103 0.032156 -0.051931 0.046971 0.586764 -0.092790 0.032589 -0.441458 0.168764 0.370160 -0.067875 0.024939
qa: -0.1952 0.1964 -0.1002 0.1216 0.3087 -0.3463 0.2132 0.0337 -0.3301 -0.1666 0.1189 -0.1479 0.2021 0.1494 0.1361 -0.2421 0.2434 0.1631 -0.2180 0.1418 0.2379 -0.4230 -0.1543 0.1445 0.1505 -0.2267 0.1418 0.1147 -0.0068 0.1519 -0.0759 0.2238 0.2138 0.2784 -0.2475 -0.2823 0.2585 0.2189
va: 3.1438 1.0111 3.8423 1.0071 4.2618 2.1273 4.3272 3.7424 2.1763 3.1800 1.0011 3.9059 1.0378 1.0143 1.0154 2.2562 1.0147 1.0055 2.1505 1.0258 4.2207 2.0847 3.7261 1.0090 1.0268 3.9673 1.0045 1.0083 3.8072 1.0005 3.5182 1.1057 0.9856 4.3828 2.2595 2.1964 1.0060 1.0009
dispcorr: -0.081988138 hartree
energy: -1406.328318817283
dipole: 9.78336 -5.92001 3.86335 1.01815 -0.95662 0.06153 3.51248 -2.48544 1.02704
magnitude: 3.99801 au
magnitude: 10.16214 debye
zeropoint: 0.31003900 hartree
thermalvibcorrection: 0.01818466 hartree
thermalrotcorrection: 0.00141627 hartree
thermaltrasncorrection: 0.00141627 hartree
thermaltotal: -1405.99726261 hartree
thermalcorr: 0.02101721 hartree
nonthermalcorr: 0.31003900 hartree
totalcorr: 0.33105621 hartree
totalenthalpy: -1405.99631840 hartree
