program: Orca
programVersion: 5.0.2
elementType: N H C H C O C C O N H C H H H O H H S H C O C H H C H H C H N H H C O O H H
charge: 1
multiplicity: 1
keywords: wB97X-D3BJ Opt Freq def2-TZVPP def2/J RIJCOSX VeryTightSCF
keywords: PAL8 defgrid3 TightOpt
frequency: 0.00 0.00 0.00 0.00 0.00 0.00 29.69 41.21 47.98 58.43 82.87 90.95 103.75 109.37 119.59 132.65 143.30 165.45 178.13 193.68 220.98 234.66 263.20 305.28 327.62 328.63 347.60 354.88 403.06 423.92 431.79 476.97 508.78 522.43 540.47 549.95 581.54 599.63 614.41 624.45 638.83 683.20 700.37 720.86 746.12 756.92 777.89 804.38 814.26 863.82 890.28 922.75 935.44 952.84 969.57 983.45 1014.73 1021.94 1055.04 1071.93 1087.99 1127.33 1154.91 1176.53 1193.10 1225.42 1236.15 1253.65 1267.01 1274.00 1294.30 1299.94 1324.90 1334.16 1366.74 1370.10 1375.88 1385.19 1403.13 1421.38 1442.47 1451.64 1467.73 1475.78 1494.46 1504.21 1509.04 1511.19 1523.77 1585.09 1603.76 1708.54 1731.62 1802.88 1815.85 1840.93 2692.85 2764.92 3032.43 3069.53 3086.85 3098.14 3101.38 3112.06 3140.88 3160.30 3171.69 3176.50 3258.72 3463.95 3573.51 3645.62 3654.49 3787.30
frequency: 29.69 41.21 47.98 58.43 82.87 90.95 103.75 109.37 119.59 132.65 143.30 165.45 178.13 193.68 220.98 234.66 263.20 305.28 327.62 328.63 347.60 354.88 403.06 423.92 431.79 476.97 508.78 522.43 540.47 549.95 581.54 599.63 614.41 624.45 638.83 683.20 700.37 720.86 746.12 756.92 777.89 804.38 814.26 863.82 890.28 922.75 935.44 952.84 969.57 983.45 1014.73 1021.94 1055.04 1071.93 1087.99 1127.33 1154.91 1176.53 1193.10 1225.42 1236.15 1253.65 1267.01 1274.00 1294.30 1299.94 1324.90 1334.16 1366.74 1370.10 1375.88 1385.19 1403.13 1421.38 1442.47 1451.64 1467.73 1475.78 1494.46 1504.21 1509.04 1511.19 1523.77 1585.09 1603.76 1708.54 1731.62 1802.88 1815.85 1840.93 2692.85 2764.92 3032.43 3069.53 3086.85 3098.14 3101.38 3112.06 3140.88 3160.30 3171.69 3176.50 3258.72 3463.95 3573.51 3645.62 3654.49 3787.30
formula: C10H18N3O6S
InChI: InChI=1S/C10H18N3O6S/c11-5(10(18)19)1-2-7(14)13-6(4-20)9(17)12-3-8(15)16/h5-6,12-13,15,18,20H,1-4H2,11H3
38 atoms
N  -0.19301 2.901344 -1.166738
H  0.052835 3.86794 -1.315654
C  -0.598883 2.118761 -2.312052
H  -0.316315 1.07609 -2.1937
C  0.050797 2.62518 -3.582892
O  0.544631 1.91189 -4.42854
C  -0.244733 2.532444 0.141669
C  -0.797742 1.128201 0.468034
O  0.032519 3.308006 1.029437
N  0.035809 0.015746 0.005774
H  -1.749314 1.041574 -0.067515
C  -1.092011 0.993847 1.967238
H  -0.401221 -0.889496 0.067774
H  -1.64496 1.867998 2.304048
H  -1.72351 0.117607 2.127633
O  -0.016138 3.944621 -3.698532
H  0.412793 4.211242 -4.524492
H  -1.682795 2.162354 -2.485635
S  0.356886 0.740381 3.011769
H  0.8701 1.962697 2.834841
C  1.377355 0.023819 0.003658
O  2.030989 1.072092 0.014184
C  2.091232 -1.312219 -0.014524
H  2.669114 -1.318118 0.913787
H  1.387413 -2.140774 0.063691
C  3.013128 -1.578943 -1.222987
H  2.433321 -2.008478 -2.038701
H  3.734862 -2.342304 -0.925361
C  3.772618 -0.401759 -1.835765
H  4.565477 -0.796213 -2.476041
N  4.40532 0.489275 -0.814979
H  3.584039 0.842402 -0.228611
H  5.112518 0.020314 -0.256061
C  2.954736 0.551206 -2.717275
O  3.27494 1.708046 -2.826994
O  1.949082 -0.046699 -3.319915
H  1.444357 0.611884 -3.866912
H  4.802621 1.301588 -1.292304
totalener: -1406.23518792 hartree
nucrepener: 1952.81049358 hartree
electener: -3359.04568151 hartree
oneelecener: -5789.72804957 hartree
twoeener: 2430.68236806 hartree
kineticenergy: 1400.65153930 hartree
exchangeener: -105.328932197330 hartree
correlationener: -7.060025493311 hartree
xcener: -112.388957690641 hartree
temp: 298.15 k
press: 1.00 atm
thermalcorrenthalpy: 0.00094421 hartree
totalenthalpy: -1405.99073675 hartree
totalentropycorr: -0.06457218 hartree
gibbsenthalpy: -1406.05530893 hartree
gibbsminuselec: 0.26363924 hartree
chargesum: 1.0000000
charge: -0.175490 0.191431 -0.083404 0.100573 0.326155 -0.326068 0.237749 0.021639 -0.333834 -0.174061 0.136711 -0.173000 0.181520 0.138460 0.120600 -0.249103 0.251321 0.145636 -0.166601 0.140564 0.303933 -0.399933 -0.226611 0.142484 0.101043 -0.185533 0.129673 0.140530 -0.025499 0.156885 -0.066665 0.228725 0.216156 0.302842 -0.322667 -0.301665 0.263713 0.231793
charge: 0.324337 -0.011722 -0.046666 0.023990 -0.403823 0.163283 -0.388581 -0.124781 0.110388 0.345205 0.038318 -0.239524 -0.010267 0.018209 0.008438 0.399676 -0.065577 0.035936 0.492355 -0.139297 -0.373604 0.164147 -0.001471 0.042165 0.035097 0.000740 0.040997 0.034218 -0.054253 0.048168 0.601449 -0.046475 0.034241 -0.461937 0.123009 0.381723 -0.139327 0.041218
qa: -0.1755 0.1914 -0.0834 0.1006 0.3262 -0.3261 0.2377 0.0216 -0.3338 -0.1741 0.1367 -0.1730 0.1815 0.1385 0.1206 -0.2491 0.2513 0.1456 -0.1666 0.1406 0.3039 -0.3999 -0.2266 0.1425 0.1010 -0.1855 0.1297 0.1405 -0.0255 0.1569 -0.0667 0.2287 0.2162 0.3028 -0.3227 -0.3017 0.2637 0.2318
va: 3.1042 1.0284 3.8673 1.0240 4.2785 2.1582 4.2914 3.7044 2.1801 3.1808 0.9913 4.0398 1.0100 1.0144 1.0021 2.2559 1.0087 0.9882 2.1787 1.0273 4.1100 2.0827 3.8737 1.0141 1.0247 3.8022 1.0228 0.9988 3.9017 0.9962 3.5797 1.0869 0.9830 4.3476 2.1800 2.2170 1.0708 0.9972
dispcorr: -0.084085403 hartree
energy: -1406.324475293267
dipole: 3.17872 -1.35253 1.82619 -10.18138 7.91612 -2.26526 1.78655 -2.87781 -1.09126
magnitude: 3.10761 au
magnitude: 7.89891 debye
zeropoint: 0.31100142 hartree
thermalvibcorrection: 0.01781969 hartree
thermalrotcorrection: 0.00141627 hartree
thermaltrasncorrection: 0.00141627 hartree
thermaltotal: -1405.99282164 hartree
thermalcorr: 0.02065223 hartree
nonthermalcorr: 0.31100142 hartree
totalcorr: 0.33165365 hartree
totalenthalpy: -1405.99187743 hartree
