program: Orca
programVersion: 5.0.2
elementType: N H C H C O C C O N H C H H H O H H S H C O C H H C H H C H N H H C O O H H
charge: 1
multiplicity: 1
keywords: wB97X-D3BJ Opt Freq def2-TZVPP def2/J RIJCOSX VeryTightSCF
keywords: PAL8 defgrid3 TightOpt
frequency: 0.00 0.00 0.00 0.00 0.00 0.00 16.98 28.93 30.81 39.02 43.36 58.60 82.41 92.85 117.17 126.72 145.53 173.50 175.55 197.76 246.34 272.69 284.13 287.70 298.36 335.03 354.53 375.34 402.11 407.78 414.62 441.50 467.83 482.87 509.88 512.65 530.15 574.76 581.06 611.46 634.00 649.24 662.29 673.18 710.67 738.37 752.93 765.54 804.43 819.06 851.03 877.87 924.61 939.93 976.12 983.89 1001.75 1020.17 1053.32 1067.36 1109.79 1146.68 1153.71 1175.00 1180.92 1187.34 1210.73 1231.32 1264.37 1274.23 1289.41 1302.52 1316.24 1332.16 1339.26 1357.62 1371.90 1376.31 1396.58 1426.64 1436.00 1448.43 1459.00 1463.23 1482.48 1493.72 1498.89 1512.15 1529.02 1600.95 1647.19 1693.88 1738.45 1793.06 1860.99 1881.84 2651.75 2755.36 3067.62 3082.09 3091.44 3099.49 3104.76 3107.50 3130.29 3146.34 3151.61 3204.35 3501.38 3553.91 3647.70 3688.87 3802.14 3852.49
frequency: 16.98 28.93 30.81 39.02 43.36 58.60 82.41 92.85 117.17 126.72 145.53 173.50 175.55 197.76 246.34 272.69 284.13 287.70 298.36 335.03 354.53 375.34 402.11 407.78 414.62 441.50 467.83 482.87 509.88 512.65 530.15 574.76 581.06 611.46 634.00 649.24 662.29 673.18 710.67 738.37 752.93 765.54 804.43 819.06 851.03 877.87 924.61 939.93 976.12 983.89 1001.75 1020.17 1053.32 1067.36 1109.79 1146.68 1153.71 1175.00 1180.92 1187.34 1210.73 1231.32 1264.37 1274.23 1289.41 1302.52 1316.24 1332.16 1339.26 1357.62 1371.90 1376.31 1396.58 1426.64 1436.00 1448.43 1459.00 1463.23 1482.48 1493.72 1498.89 1512.15 1529.02 1600.95 1647.19 1693.88 1738.45 1793.06 1860.99 1881.84 2651.75 2755.36 3067.62 3082.09 3091.44 3099.49 3104.76 3107.50 3130.29 3146.34 3151.61 3204.35 3501.38 3553.91 3647.70 3688.87 3802.14 3852.49
formula: C10H18N3O6S
InChI: InChI=1S/C10H18N3O6S/c11-5(10(18)19)1-2-7(14)13-6(4-20)9(17)12-3-8(15)16/h5-6,12-13,15,18,20H,1-4H2,11H3
38 atoms
N  -0.615102 3.429771 -1.400245
H  -0.218754 3.818231 -2.241539
C  -1.528334 4.268904 -0.672744
H  -1.94957 5.002757 -1.362835
C  -0.874635 5.046196 0.461742
O  0.290513 5.006972 0.74802
C  -0.242229 2.131984 -1.239189
C  -0.743676 1.295177 -0.029792
O  0.402994 1.572112 -2.099041
N  0.043678 0.070487 0.043802
H  -1.741362 0.979988 -0.355818
C  -0.952707 1.883748 1.378818
H  -0.438859 -0.799467 -0.095674
H  -1.539543 2.794958 1.346221
H  -1.561416 1.163028 1.928361
O  -1.786205 5.787317 1.103918
H  -1.337986 6.285455 1.800954
H  -2.385411 3.717347 -0.285651
S  0.470507 2.139623 2.457451
H  1.061692 3.103791 1.742462
C  1.382117 0.033522 0.034473
O  2.092863 1.041638 0.031768
C  2.031039 -1.336888 0.104184
H  1.333284 -2.134595 -0.150741
H  2.81203 -1.350777 -0.658582
C  2.6265 -1.636401 1.496422
H  3.300208 -2.49251 1.408238
H  1.82492 -1.93919 2.172928
C  3.365175 -0.465779 2.164475
H  2.643183 0.281767 2.505948
N  4.243707 0.239761 1.188665
H  4.888986 -0.405193 0.735518
H  3.560588 0.696847 0.500605
C  4.25195 -0.935947 3.316028
O  5.445001 -0.869759 3.239775
O  3.634014 -1.438926 4.384594
H  2.6755 -1.360667 4.335121
H  4.818885 0.934031 1.663892
totalener: -1406.21117170 hartree
nucrepener: 1873.92914649 hartree
electener: -3280.14031819 hartree
oneelecener: -5632.05990632 hartree
twoeener: 2351.91958813 hartree
kineticenergy: 1400.63919321 hartree
exchangeener: -105.318110939779 hartree
correlationener: -7.055103778222 hartree
xcener: -112.373214718002 hartree
temp: 298.15 k
press: 1.00 atm
thermalcorrenthalpy: 0.00094421 hartree
totalenthalpy: -1405.96415612 hartree
totalentropycorr: -0.06557348 hartree
gibbsenthalpy: -1406.02972960 hartree
gibbsminuselec: 0.26293526 hartree
chargesum: 1.0000000
charge: -0.166122 0.191879 -0.147738 0.152442 0.307247 -0.312926 0.231962 0.007066 -0.330209 -0.144983 0.136351 -0.172787 0.181571 0.097059 0.136352 -0.256565 0.243876 0.131400 -0.163881 0.147099 0.346675 -0.389345 -0.276634 0.108296 0.146202 -0.189708 0.145875 0.103693 -0.093603 0.127456 -0.050712 0.221301 0.225888 0.322431 -0.273886 -0.196854 0.222947 0.230886
charge: 0.332796 -0.004096 -0.062479 0.045546 -0.456457 0.119376 -0.381956 -0.111375 0.104281 0.363016 0.047517 -0.249244 -0.012200 -0.000174 0.015655 0.375373 -0.078859 0.030563 0.493907 -0.143265 -0.361333 0.156444 0.001871 0.034968 0.038353 0.000094 0.040620 0.034058 -0.076355 0.023788 0.603549 0.045072 -0.052136 -0.442566 0.152875 0.415728 -0.091470 0.048512
qa: -0.1661 0.1919 -0.1477 0.1524 0.3072 -0.3129 0.2320 0.0071 -0.3302 -0.1450 0.1364 -0.1728 0.1816 0.0971 0.1364 -0.2566 0.2439 0.1314 -0.1639 0.1471 0.3467 -0.3893 -0.2766 0.1083 0.1462 -0.1897 0.1459 0.1037 -0.0936 0.1275 -0.0507 0.2213 0.2259 0.3224 -0.2739 -0.1969 0.2229 0.2309
va: 3.1169 1.0167 3.8620 1.0003 4.2663 2.1751 4.3501 3.7453 2.1935 3.2393 0.9921 4.0018 1.0126 1.0186 1.0008 2.2265 1.0135 0.9984 2.1829 1.0268 4.0970 2.1063 3.8770 1.0218 1.0109 3.7822 1.0050 1.0210 3.7991 1.0857 3.6099 0.9908 1.0895 4.3673 2.2261 2.2882 1.0207 0.9838
dispcorr: -0.081767297 hartree
energy: -1406.298686267691
dipole: -2.86672 2.38240 -0.48432 -6.94940 5.37496 -1.57444 -2.09321 2.10056 0.00735
magnitude: 1.64726 au
magnitude: 4.18701 debye
zeropoint: 0.31039320 hartree
thermalvibcorrection: 0.01844415 hartree
thermalrotcorrection: 0.00141627 hartree
thermaltrasncorrection: 0.00141627 hartree
thermaltotal: -1405.96701638 hartree
thermalcorr: 0.02127669 hartree
nonthermalcorr: 0.31039320 hartree
totalcorr: 0.33166989 hartree
totalenthalpy: -1405.96607217 hartree
