program: Orca
programVersion: 5.0.2
elementType: N H C H C O C C O N H C H H H O H H S H C O C H H C H H C H N H H C O O H H
charge: 1
multiplicity: 1
keywords: wB97X-D3BJ Opt Freq def2-TZVPP def2/J RIJCOSX VeryTightSCF
keywords: PAL8 defgrid3 TightOpt
frequency: 0.00 0.00 0.00 0.00 0.00 0.00 21.49 26.79 40.06 52.08 59.57 61.99 77.04 86.90 99.50 115.84 123.81 158.44 169.15 204.21 216.65 239.66 244.60 272.09 285.20 321.48 348.77 357.36 398.42 429.98 441.72 469.46 472.08 530.13 535.53 540.69 560.10 585.05 615.83 626.55 639.01 671.17 690.95 718.84 730.19 737.30 762.45 807.73 826.03 833.25 861.25 882.27 883.76 921.80 964.62 986.14 1002.57 1023.40 1042.90 1068.01 1119.35 1139.34 1152.86 1164.65 1181.68 1188.17 1199.13 1217.29 1245.06 1273.41 1280.39 1304.08 1329.90 1336.77 1347.49 1355.72 1380.66 1391.19 1393.80 1396.07 1401.26 1425.06 1437.59 1475.29 1485.77 1494.61 1499.77 1516.30 1536.70 1590.47 1635.96 1682.30 1724.30 1817.69 1886.42 1889.71 2771.60 2801.46 3075.68 3097.44 3103.74 3106.37 3113.59 3127.12 3150.84 3157.92 3175.57 3195.28 3387.00 3543.58 3591.99 3628.69 3772.96 3788.70
frequency: 21.49 26.79 40.06 52.08 59.57 61.99 77.04 86.90 99.50 115.84 123.81 158.44 169.15 204.21 216.65 239.66 244.60 272.09 285.20 321.48 348.77 357.36 398.42 429.98 441.72 469.46 472.08 530.13 535.53 540.69 560.10 585.05 615.83 626.55 639.01 671.17 690.95 718.84 730.19 737.30 762.45 807.73 826.03 833.25 861.25 882.27 883.76 921.80 964.62 986.14 1002.57 1023.40 1042.90 1068.01 1119.35 1139.34 1152.86 1164.65 1181.68 1188.17 1199.13 1217.29 1245.06 1273.41 1280.39 1304.08 1329.90 1336.77 1347.49 1355.72 1380.66 1391.19 1393.80 1396.07 1401.26 1425.06 1437.59 1475.29 1485.77 1494.61 1499.77 1516.30 1536.70 1590.47 1635.96 1682.30 1724.30 1817.69 1886.42 1889.71 2771.60 2801.46 3075.68 3097.44 3103.74 3106.37 3113.59 3127.12 3150.84 3157.92 3175.57 3195.28 3387.00 3543.58 3591.99 3628.69 3772.96 3788.70
formula: C10H18N3O6S
InChI: InChI=1S/C10H18N3O6S/c11-5(10(18)19)1-2-7(14)13-6(4-20)9(17)12-3-8(15)16/h5-6,12-13,15,18,20H,1-4H2,11H3
38 atoms
N  -0.062694 1.516414 2.531181
H  0.005345 2.246379 3.228794
C  -0.454438 0.233123 3.07884
H  -1.403193 0.281319 3.623587
C  0.541286 -0.3676 4.049269
O  0.398592 -1.433885 4.566625
C  -0.550597 2.081035 1.361028
C  -0.765385 1.253529 0.077747
O  -0.738719 3.271204 1.291845
N  -0.005663 0.016262 0.008879
H  -0.385346 1.927595 -0.690913
C  -2.244096 1.01938 -0.222881
H  -0.506859 -0.858991 -0.009962
H  -2.764488 1.968424 -0.110219
H  -2.345718 0.680146 -1.252757
O  1.63328 0.418301 4.3100
H  2.088809 -0.00908 5.050405
H  -0.60086 -0.502908 2.294233
S  -2.947171 -0.234843 0.889583
H  -4.009041 -0.544092 0.140124
C  1.329459 0.047522 -0.000539
O  1.930762 1.131825 -0.007916
C  2.08216 -1.260278 0.055255
H  1.4006 -2.105925 -0.046299
H  2.764533 -1.285649 -0.795352
C  2.872697 -1.444536 1.362632
H  3.336942 -2.429899 1.322532
H  2.196311 -1.463818 2.220402
C  4.011335 -0.463629 1.660668
H  4.562562 -0.837125 2.527734
N  3.524808 0.908666 2.00889
H  2.946846 1.243426 1.185941
H  2.913288 0.887595 2.832356
C  5.025619 -0.384878 0.520697
O  5.255424 -1.297143 -0.214117
O  5.644378 0.805796 0.49603
H  6.300566 0.804734 -0.2156
H  4.303905 1.544794 2.16565
totalener: -1406.22641098 hartree
nucrepener: 1901.01403195 hartree
electener: -3307.24044292 hartree
oneelecener: -5684.67206762 hartree
twoeener: 2377.43162469 hartree
kineticenergy: 1400.64781930 hartree
exchangeener: -105.314114132598 hartree
correlationener: -7.053005035156 hartree
xcener: -112.367119167754 hartree
temp: 298.15 k
press: 1.00 atm
thermalcorrenthalpy: 0.00094421 hartree
totalenthalpy: -1405.97959451 hartree
totalentropycorr: -0.06591891 hartree
gibbsenthalpy: -1406.04551342 hartree
gibbsminuselec: 0.26304074 hartree
chargesum: 1.0000000
charge: -0.237343 0.190386 -0.113105 0.176238 0.270381 -0.243742 0.185404 0.038707 -0.278616 -0.190281 0.150057 -0.167839 0.180395 0.145769 0.141637 -0.324626 0.249365 0.114198 -0.175171 0.134248 0.280450 -0.418600 -0.184332 0.115909 0.145044 -0.192832 0.161539 0.104944 -0.014098 0.154363 -0.088836 0.234307 0.227589 0.282409 -0.250238 -0.284617 0.256624 0.224314
charge: 0.283654 -0.011775 -0.069618 0.042506 -0.431320 0.159112 -0.374437 -0.134202 0.136430 0.355651 0.055183 -0.213733 -0.026058 0.020129 0.011689 0.339719 -0.084975 0.019668 0.486445 -0.137154 -0.352464 0.133796 0.004507 0.036714 0.045364 0.008977 0.051690 0.029854 -0.053647 0.048866 0.598773 -0.055499 0.006177 -0.433724 0.167886 0.367410 -0.065684 0.034090
qa: -0.2373 0.1904 -0.1131 0.1762 0.2704 -0.2437 0.1854 0.0387 -0.2786 -0.1903 0.1501 -0.1678 0.1804 0.1458 0.1416 -0.3246 0.2494 0.1142 -0.1752 0.1342 0.2805 -0.4186 -0.1843 0.1159 0.1450 -0.1928 0.1615 0.1049 -0.0141 0.1544 -0.0888 0.2343 0.2276 0.2824 -0.2502 -0.2846 0.2566 0.2243
va: 2.9406 1.0153 3.7878 0.9961 4.3012 2.2682 4.3411 3.7660 2.2481 3.2159 1.0267 3.9760 1.0400 1.0118 0.9952 2.1241 1.0094 1.0352 2.1614 1.0165 4.1078 2.0772 3.8599 1.0146 1.0224 3.8928 1.0067 1.0307 3.8378 1.0006 3.5324 1.0846 1.0313 4.3749 2.2498 2.2048 1.0073 0.9914
dispcorr: -0.083105881 hartree
energy: -1406.314353280589
dipole: 0.95084 0.99785 1.94869 -3.05939 2.55284 -0.50655 -1.28657 1.68816 0.40159
magnitude: 2.05311 au
magnitude: 5.21860 debye
zeropoint: 0.31057715 hartree
thermalvibcorrection: 0.01845894 hartree
thermalrotcorrection: 0.00141627 hartree
thermaltrasncorrection: 0.00141627 hartree
thermaltotal: -1405.98248466 hartree
thermalcorr: 0.02129148 hartree
nonthermalcorr: 0.31057715 hartree
totalcorr: 0.33186862 hartree
totalenthalpy: -1405.98154045 hartree
