program: Orca
programVersion: 5.0.2
elementType: N H C H C O C C O N H C H H H O H H S H C O C H H C H H C H N H H C O O H H
charge: 1
multiplicity: 1
keywords: wB97X-D3BJ Opt Freq def2-TZVPP def2/J RIJCOSX VeryTightSCF
keywords: PAL8 defgrid3 TightOpt
frequency: 0.00 0.00 0.00 0.00 0.00 0.00 20.32 27.88 39.56 45.50 56.52 61.66 74.05 94.30 103.57 134.41 147.07 163.77 177.78 190.71 207.61 240.92 252.06 259.74 269.35 305.50 319.03 346.00 372.63 399.47 414.77 438.66 465.30 507.49 516.18 549.13 576.56 580.68 611.12 623.76 650.45 660.98 711.27 718.96 729.14 736.11 763.28 815.31 827.92 856.53 880.61 882.76 920.57 937.17 971.34 977.41 996.29 1015.37 1048.12 1063.29 1109.67 1124.16 1155.33 1164.99 1188.13 1195.85 1211.72 1216.89 1235.29 1278.69 1288.25 1295.56 1309.47 1332.16 1338.06 1347.28 1375.49 1396.56 1401.96 1427.12 1448.40 1452.27 1468.69 1485.57 1495.22 1498.29 1503.37 1523.17 1527.87 1595.77 1627.26 1683.26 1738.37 1775.78 1850.30 1853.68 2765.25 3080.06 3098.72 3103.99 3105.84 3116.05 3146.71 3153.42 3157.44 3157.80 3167.06 3196.75 3353.62 3485.46 3635.10 3670.19 3787.61 3797.02
frequency: 20.32 27.88 39.56 45.50 56.52 61.66 74.05 94.30 103.57 134.41 147.07 163.77 177.78 190.71 207.61 240.92 252.06 259.74 269.35 305.50 319.03 346.00 372.63 399.47 414.77 438.66 465.30 507.49 516.18 549.13 576.56 580.68 611.12 623.76 650.45 660.98 711.27 718.96 729.14 736.11 763.28 815.31 827.92 856.53 880.61 882.76 920.57 937.17 971.34 977.41 996.29 1015.37 1048.12 1063.29 1109.67 1124.16 1155.33 1164.99 1188.13 1195.85 1211.72 1216.89 1235.29 1278.69 1288.25 1295.56 1309.47 1332.16 1338.06 1347.28 1375.49 1396.56 1401.96 1427.12 1448.40 1452.27 1468.69 1485.57 1495.22 1498.29 1503.37 1523.17 1527.87 1595.77 1627.26 1683.26 1738.37 1775.78 1850.30 1853.68 2765.25 3080.06 3098.72 3103.99 3105.84 3116.05 3146.71 3153.42 3157.44 3157.80 3167.06 3196.75 3353.62 3485.46 3635.10 3670.19 3787.61 3797.02
formula: C10H18N3O6S
InChI: InChI=1S/C10H18N3O6S/c11-5(10(18)19)1-2-7(14)13-6(4-20)9(17)12-3-8(15)16/h5-6,12-13,15,18,20H,1-4H2,11H3
38 atoms
N  -0.0932 2.333213 -1.686348
H  0.611419 2.761159 -2.268108
C  -1.471941 2.60116 -2.027382
H  -2.106925 2.656801 -1.140534
C  -2.055258 1.540619 -2.955407
O  -1.575678 0.450195 -3.121056
C  0.361749 1.275074 -0.986605
C  -0.646656 0.527903 -0.099937
O  1.548333 0.960953 -1.031004
N  -0.207793 -0.841313 0.09343
H  -1.591192 0.45188 -0.633988
C  -0.903507 1.304619 1.195623
H  -0.529882 -1.497311 -0.597889
H  0.012362 1.407179 1.768693
H  -1.278829 2.293471 0.933379
O  -3.181913 1.972109 -3.52232
H  -3.543989 1.264109 -4.073121
H  -1.53534 3.575957 -2.508293
S  -2.157155 0.402384 2.144174
H  -2.345743 1.346189 3.072096
C  0.829676 -1.224605 0.867968
O  1.342635 -0.509407 1.722744
C  1.412061 -2.586123 0.542775
H  1.770345 -3.032112 1.471215
H  0.654773 -3.248361 0.12012
C  2.561619 -2.447982 -0.471145
H  2.214305 -1.936771 -1.374039
H  2.880427 -3.445084 -0.772698
C  3.806005 -1.734299 0.062917
H  4.116144 -2.192653 1.005912
N  3.582707 -0.282461 0.329128
H  2.910812 0.146175 -0.340586
H  3.116765 -0.165162 1.238236
C  5.004547 -1.807063 -0.880947
O  5.663328 -0.841133 -1.161167
O  5.235702 -3.044876 -1.302069
H  6.026207 -3.041852 -1.861007
H  4.474641 0.211659 0.260946
totalener: -1406.25281430 hartree
nucrepener: 1855.07219768 hartree
electener: -3261.32501197 hartree
oneelecener: -5594.60371812 hartree
twoeener: 2333.27870615 hartree
kineticenergy: 1401.50452495 hartree
exchangeener: -105.478190206850 hartree
correlationener: -7.063182113082 hartree
xcener: -112.541372319932 hartree
temp: 298.15 k
press: 1.00 atm
thermalcorrenthalpy: 0.00094421 hartree
totalenthalpy: -1405.99980241 hartree
totalentropycorr: -0.07089425 hartree
gibbsenthalpy: -1406.07069667 hartree
gibbsminuselec: 0.26261105 hartree
chargesum: 1.0000000
charge: -0.173472 0.193091 -0.092848 0.127283 0.288313 -0.314385 0.256662 0.095733 -0.436040 -0.204014 0.129866 -0.184988 0.183975 0.139949 0.119400 -0.246403 0.247017 0.154085 -0.140144 0.116577 0.242947 -0.420460 -0.155451 0.121875 0.115579 -0.203086 0.118746 0.140039 0.003513 0.139351 -0.044002 0.227107 0.228210 0.296984 -0.298488 -0.247105 0.253739 0.220844
charge: 0.345018 -0.001910 -0.044286 0.037363 -0.446265 0.115381 -0.337393 -0.139604 0.095139 0.350282 0.034711 -0.227851 -0.009607 -0.001608 0.001845 0.385541 -0.074649 0.043717 0.483222 -0.143786 -0.374149 0.091814 0.000131 0.039735 0.033967 0.000191 0.033880 0.041427 -0.049951 0.049421 0.610145 -0.018275 0.007572 -0.431506 0.135966 0.397542 -0.064955 0.031789
qa: -0.1735 0.1931 -0.0928 0.1273 0.2883 -0.3144 0.2567 0.0957 -0.4360 -0.2040 0.1299 -0.1850 0.1840 0.1399 0.1194 -0.2464 0.2470 0.1541 -0.1401 0.1166 0.2429 -0.4205 -0.1555 0.1219 0.1156 -0.2031 0.1187 0.1400 0.0035 0.1394 -0.0440 0.2271 0.2282 0.2970 -0.2985 -0.2471 0.2537 0.2208
va: 3.1950 1.0123 3.8445 1.0024 4.3118 2.1768 4.2678 3.7620 2.0471 3.1972 1.0252 3.9963 1.0110 1.0198 0.9997 2.2537 1.0110 1.0042 2.1652 1.0206 4.1914 2.0613 3.8136 1.0261 1.0119 3.8574 1.0171 1.0217 3.8568 1.0086 3.5857 1.0727 1.0265 4.3522 2.1935 2.2591 1.0063 1.0031
dispcorr: -0.080541533 hartree
energy: -1406.336619517625
dipole: 1.65602 -0.44403 1.21199 -1.24328 0.97918 -0.26409 2.51447 -3.19762 -0.68315
magnitude: 1.41610 au
magnitude: 3.59945 debye
zeropoint: 0.31132050 hartree
thermalvibcorrection: 0.01859160 hartree
thermalrotcorrection: 0.00141627 hartree
thermaltrasncorrection: 0.00141627 hartree
thermaltotal: -1406.00387488 hartree
thermalcorr: 0.02142414 hartree
nonthermalcorr: 0.31132050 hartree
totalcorr: 0.33274464 hartree
totalenthalpy: -1406.00293067 hartree
