program: Orca
programVersion: 5.0.2
elementType: N H C H C O C C O N H C H H H O H H S H C O C H H C H H C H N H H C O O H H
charge: 1
multiplicity: 1
keywords: wB97X-D3BJ Opt Freq def2-TZVPP def2/J RIJCOSX VeryTightSCF
keywords: PAL8 defgrid3 TightOpt
frequency: 0.00 0.00 0.00 0.00 0.00 0.00 25.35 36.38 36.92 39.79 52.36 69.90 73.32 76.84 102.79 119.78 153.94 158.87 172.30 198.03 214.79 232.07 239.54 263.61 289.34 295.43 310.42 336.35 364.97 402.76 420.04 467.39 483.12 525.14 528.83 540.76 571.63 589.88 604.26 630.35 645.02 648.50 672.17 679.55 709.74 729.50 754.02 762.94 780.17 842.04 862.23 889.44 896.79 938.43 963.61 1000.02 1009.98 1031.31 1073.75 1082.85 1125.83 1140.99 1154.48 1170.72 1187.03 1204.79 1210.07 1247.17 1252.47 1257.35 1300.04 1305.14 1317.06 1325.41 1343.16 1349.49 1366.81 1386.71 1405.23 1408.58 1419.52 1436.52 1459.51 1468.79 1476.59 1482.59 1491.98 1518.24 1558.21 1574.41 1610.47 1682.75 1739.34 1811.52 1813.93 1892.25 2761.33 3025.41 3083.60 3089.28 3097.30 3119.84 3124.26 3127.49 3128.36 3138.36 3160.28 3179.80 3344.85 3527.45 3617.73 3636.73 3791.50 3803.13
frequency: 25.35 36.38 36.92 39.79 52.36 69.90 73.32 76.84 102.79 119.78 153.94 158.87 172.30 198.03 214.79 232.07 239.54 263.61 289.34 295.43 310.42 336.35 364.97 402.76 420.04 467.39 483.12 525.14 528.83 540.76 571.63 589.88 604.26 630.35 645.02 648.50 672.17 679.55 709.74 729.50 754.02 762.94 780.17 842.04 862.23 889.44 896.79 938.43 963.61 1000.02 1009.98 1031.31 1073.75 1082.85 1125.83 1140.99 1154.48 1170.72 1187.03 1204.79 1210.07 1247.17 1252.47 1257.35 1300.04 1305.14 1317.06 1325.41 1343.16 1349.49 1366.81 1386.71 1405.23 1408.58 1419.52 1436.52 1459.51 1468.79 1476.59 1482.59 1491.98 1518.24 1558.21 1574.41 1610.47 1682.75 1739.34 1811.52 1813.93 1892.25 2761.33 3025.41 3083.60 3089.28 3097.30 3119.84 3124.26 3127.49 3128.36 3138.36 3160.28 3179.80 3344.85 3527.45 3617.73 3636.73 3791.50 3803.13
formula: C10H18N3O6S
InChI: InChI=1S/C10H18N3O6S/c11-5(10(18)19)1-2-7(14)13-6(4-20)9(17)12-3-8(15)16/h5-6,12-13,15,18,20H,1-4H2,11H3
38 atoms
N  -0.333742 1.422457 2.612924
H  -0.276099 2.115698 3.345056
C  -0.737661 0.11031 3.048029
H  -1.415787 0.173714 3.903499
C  0.407099 -0.791144 3.457769
O  1.59156 -0.569737 3.318159
C  -0.658663 2.034634 1.419422
C  -0.742123 1.241014 0.101784
O  -0.808689 3.232231 1.362897
N  0.011028 0.002348 0.079415
H  -0.264474 1.930028 -0.59611
C  -2.182343 1.051824 -0.383423
H  -0.492263 -0.870862 0.088851
H  -2.725741 1.976013 -0.192967
H  -2.188308 0.884916 -1.458475
O  -0.053133 -1.914227 3.999115
H  0.69053 -2.465724 4.277685
H  -1.306536 -0.412035 2.278357
S  -3.096366 -0.305449 0.406472
H  -3.026206 -1.179321 -0.602833
C  1.352612 0.023727 0.073326
O  1.967756 1.092543 0.068519
C  2.064478 -1.318701 0.073631
H  1.689603 -1.925498 0.901825
H  1.784196 -1.841261 -0.84465
C  3.586953 -1.198279 0.123714
H  3.92533 -0.483436 -0.629746
H  4.030575 -2.16086 -0.12874
C  4.171205 -0.813277 1.486665
H  3.836927 -1.521615 2.246775
N  3.723848 0.54802 1.935577
H  4.503679 1.088854 2.30485
H  3.260018 1.032141 1.131683
C  5.693844 -0.919999 1.443034
O  6.257877 -1.887442 1.031653
O  6.3044 0.175103 1.932772
H  7.261933 0.040254 1.89428
H  2.983851 0.444487 2.642357
totalener: -1406.24237925 hartree
nucrepener: 1875.18973783 hartree
electener: -3281.43211708 hartree
oneelecener: -5633.68578323 hartree
twoeener: 2352.25366615 hartree
kineticenergy: 1400.66202957 hartree
exchangeener: -105.324763146486 hartree
correlationener: -7.054604895075 hartree
xcener: -112.379368041561 hartree
temp: 298.15 k
press: 1.00 atm
thermalcorrenthalpy: 0.00094421 hartree
totalenthalpy: -1405.99407517 hartree
totalentropycorr: -0.06583633 hartree
gibbsenthalpy: -1406.05991149 hartree
gibbsminuselec: 0.26321068 hartree
chargesum: 1.0000000
charge: -0.217902 0.186613 -0.058810 0.170190 0.316916 -0.399533 0.167380 0.057218 -0.286414 -0.200001 0.141408 -0.159694 0.159892 0.152628 0.139586 -0.228528 0.240227 0.089305 -0.142772 0.115941 0.266723 -0.410120 -0.193497 0.110579 0.154604 -0.217360 0.137934 0.144768 0.003077 0.131651 -0.055432 0.217284 0.228234 0.287354 -0.251778 -0.287324 0.253547 0.236105
charge: 0.305100 -0.011071 -0.063185 0.044078 -0.416372 0.100333 -0.376866 -0.135775 0.127545 0.344703 0.053565 -0.220108 -0.032447 0.024842 0.014193 0.401536 -0.076434 0.010085 0.510684 -0.149562 -0.358237 0.120303 -0.008396 0.030794 0.044494 0.004992 0.038659 0.045933 -0.045972 0.043352 0.608066 0.019712 -0.029856 -0.427397 0.167371 0.362315 -0.067082 -0.003896
qa: -0.2179 0.1866 -0.0588 0.1702 0.3169 -0.3995 0.1674 0.0572 -0.2864 -0.2000 0.1414 -0.1597 0.1599 0.1526 0.1396 -0.2285 0.2402 0.0893 -0.1428 0.1159 0.2667 -0.4101 -0.1935 0.1106 0.1546 -0.2174 0.1379 0.1448 0.0031 0.1317 -0.0554 0.2173 0.2282 0.2874 -0.2518 -0.2873 0.2535 0.2361
va: 3.0203 1.0177 3.7517 1.0050 4.2402 2.0496 4.3630 3.7372 2.2406 3.1765 1.0345 3.9064 1.0588 1.0110 0.9954 2.2757 1.0175 1.1039 2.1939 1.0181 4.1368 2.0784 3.8422 1.0096 0.9984 3.9240 1.0089 1.0216 3.8373 1.0244 3.5515 1.0066 1.0650 4.3384 2.2531 2.1881 1.0070 1.0294
dispcorr: -0.081298273 hartree
energy: -1406.328616803063
dipole: 0.84068 0.68108 1.52175 -3.49202 1.98579 -1.50623 -3.42224 4.13907 0.71682
magnitude: 2.25794 au
magnitude: 5.73923 debye
zeropoint: 0.31040295 hartree
thermalvibcorrection: 0.01867421 hartree
thermalrotcorrection: 0.00141627 hartree
thermaltrasncorrection: 0.00141627 hartree
thermaltotal: -1405.99670710 hartree
thermalcorr: 0.02150676 hartree
nonthermalcorr: 0.31040295 hartree
totalcorr: 0.33190970 hartree
totalenthalpy: -1405.99576289 hartree
