program: Orca
programVersion: 5.0.2
elementType: N H C H C O C C O N H C H H H O H H S H C O C H H C H H C H N H H C O O H H
charge: 1
multiplicity: 1
keywords: wB97X-D3BJ Opt Freq def2-TZVPP def2/J RIJCOSX VeryTightSCF
keywords: PAL8 defgrid3 TightOpt
frequency: 0.00 0.00 0.00 0.00 0.00 0.00 14.83 17.54 22.07 37.08 48.08 53.69 61.59 75.55 94.09 110.13 132.84 155.46 171.94 209.53 243.65 245.99 272.38 282.22 289.31 291.99 329.98 380.58 389.43 417.92 436.41 454.41 488.59 506.87 522.39 560.24 573.12 593.19 605.76 617.66 655.94 658.62 676.44 700.25 724.67 730.86 749.05 793.90 826.00 842.81 869.08 881.73 922.68 935.45 960.11 992.93 1003.79 1027.29 1059.97 1088.82 1120.85 1142.00 1164.42 1166.21 1188.28 1191.01 1209.65 1228.04 1241.56 1264.17 1294.03 1297.82 1318.17 1331.21 1334.19 1348.02 1359.19 1365.15 1410.77 1423.50 1449.53 1458.47 1460.50 1475.14 1482.21 1487.41 1494.86 1521.95 1567.47 1597.43 1616.91 1676.93 1719.84 1788.30 1854.34 1864.52 2186.00 2752.74 3077.04 3091.42 3095.63 3114.71 3118.79 3133.11 3152.46 3155.03 3178.18 3193.51 3412.71 3573.03 3624.98 3648.16 3783.70 3802.04
frequency: 14.83 17.54 22.07 37.08 48.08 53.69 61.59 75.55 94.09 110.13 132.84 155.46 171.94 209.53 243.65 245.99 272.38 282.22 289.31 291.99 329.98 380.58 389.43 417.92 436.41 454.41 488.59 506.87 522.39 560.24 573.12 593.19 605.76 617.66 655.94 658.62 676.44 700.25 724.67 730.86 749.05 793.90 826.00 842.81 869.08 881.73 922.68 935.45 960.11 992.93 1003.79 1027.29 1059.97 1088.82 1120.85 1142.00 1164.42 1166.21 1188.28 1191.01 1209.65 1228.04 1241.56 1264.17 1294.03 1297.82 1318.17 1331.21 1334.19 1348.02 1359.19 1365.15 1410.77 1423.50 1449.53 1458.47 1460.50 1475.14 1482.21 1487.41 1494.86 1521.95 1567.47 1597.43 1616.91 1676.93 1719.84 1788.30 1854.34 1864.52 2186.00 2752.74 3077.04 3091.42 3095.63 3114.71 3118.79 3133.11 3152.46 3155.03 3178.18 3193.51 3412.71 3573.03 3624.98 3648.16 3783.70 3802.04
formula: C10H18N3O6S
InChI: InChI=1S/C10H18N3O6S/c11-5(10(18)19)1-2-7(14)13-6(4-20)9(17)12-3-8(15)16/h5-6,12-13,15,18,20H,1-4H2,11H3
38 atoms
N  -2.719733 1.90552 1.170879
H  -3.578955 1.689188 1.651539
C  -2.168078 3.225738 1.341204
H  -2.618112 3.682099 2.222359
C  -2.389137 4.151197 0.15427
O  -2.733378 3.801925 -0.941249
C  -2.228013 0.872212 0.448533
C  -0.994349 1.083055 -0.434759
O  -2.736299 -0.234291 0.463534
N  -0.110992 -0.040316 -0.15677
H  -0.450725 1.999035 -0.221047
C  -1.441703 1.049778 -1.904207
H  -0.570522 -0.938246 -0.106181
H  -1.987984 0.121936 -2.080331
H  -2.115891 1.878777 -2.102084
O  -2.108975 5.417047 0.489337
H  -2.246327 5.973252 -0.289531
H  -1.093126 3.193406 1.537537
S  -0.072646 1.05145 -3.080254
H  0.27321 2.335312 -2.930438
C  1.209742 0.041742 -0.11165
O  1.805197 1.137698 -0.108051
C  1.958079 -1.276994 -0.08595
H  1.353845 -2.017568 0.440574
H  2.016757 -1.621296 -1.123803
C  3.348048 -1.22675 0.558649
H  3.651934 -2.246521 0.794198
H  3.30676 -0.685634 1.506821
C  4.470948 -0.628621 -0.296441
H  5.424547 -0.795392 0.208377
N  4.297693 0.836551 -0.518726
H  4.547263 1.043955 -1.491449
H  3.234251 1.075052 -0.354496
C  4.58596 -1.257661 -1.682443
O  4.627985 -0.601691 -2.689127
O  4.647877 -2.582126 -1.619869
H  4.756548 -2.935723 -2.514884
H  4.873541 1.390991 0.107394
totalener: -1406.25069581 hartree
nucrepener: 1800.61249390 hartree
electener: -3206.86318971 hartree
oneelecener: -5486.27804861 hartree
twoeener: 2279.41485890 hartree
kineticenergy: 1400.65410477 hartree
exchangeener: -105.326447877447 hartree
correlationener: -7.051641212001 hartree
xcener: -112.378089089449 hartree
temp: 298.15 k
press: 1.00 atm
thermalcorrenthalpy: 0.00094421 hartree
totalenthalpy: -1406.00011811 hartree
totalentropycorr: -0.06637305 hartree
gibbsenthalpy: -1406.06649116 hartree
gibbsminuselec: 0.26117423 hartree
chargesum: 1.0000000
charge: -0.165480 0.193626 -0.121482 0.149357 0.309840 -0.311750 0.223919 0.057095 -0.357721 -0.151786 0.094721 -0.165344 0.192964 0.133052 0.151416 -0.259575 0.243202 0.124862 -0.154759 0.098030 0.271013 -0.418827 -0.157307 0.133104 0.122174 -0.207576 0.144405 0.134183 -0.019653 0.150489 -0.082274 0.215262 0.213273 0.283637 -0.289074 -0.249786 0.257561 0.215205
charge: 0.338832 -0.004796 -0.054824 0.043098 -0.443097 0.126769 -0.377366 -0.119453 0.088079 0.373709 0.024802 -0.236174 -0.000341 0.016834 0.009400 0.373061 -0.079832 0.034095 0.483796 -0.150275 -0.342539 0.156874 -0.000630 0.041926 0.042135 0.001962 0.044654 0.036087 -0.058066 0.046494 0.588279 0.021707 -0.096388 -0.439469 0.144406 0.400854 -0.063598 0.028995
qa: -0.1655 0.1936 -0.1215 0.1494 0.3098 -0.3118 0.2239 0.0571 -0.3577 -0.1518 0.0947 -0.1653 0.1930 0.1331 0.1514 -0.2596 0.2432 0.1249 -0.1548 0.0980 0.2710 -0.4188 -0.1573 0.1331 0.1222 -0.2076 0.1444 0.1342 -0.0197 0.1505 -0.0823 0.2153 0.2133 0.2836 -0.2891 -0.2498 0.2576 0.2152
va: 3.1519 1.0120 3.8507 1.0061 4.2584 2.1639 4.3434 3.8539 2.1732 3.3165 1.0405 3.9249 1.0279 1.0200 1.0263 2.2251 1.0141 1.0010 2.1739 1.0251 4.1874 2.0837 3.7945 1.0029 1.0195 3.8942 1.0095 1.0055 3.9318 1.0014 3.5132 1.0194 1.1245 4.3409 2.2003 2.2630 1.0028 0.9853
dispcorr: -0.077806714 hartree
energy: -1406.333269048291
dipole: 8.35438 -4.32133 4.03306 -2.34302 2.09117 -0.25185 6.09708 -4.43216 1.66491
magnitude: 4.37046 au
magnitude: 11.10882 debye
zeropoint: 0.30940749 hartree
thermalvibcorrection: 0.01861888 hartree
thermalrotcorrection: 0.00141627 hartree
thermaltrasncorrection: 0.00141627 hartree
thermaltotal: -1406.00241014 hartree
thermalcorr: 0.02145142 hartree
nonthermalcorr: 0.30940749 hartree
totalcorr: 0.33085891 hartree
totalenthalpy: -1406.00146593 hartree
