program: Orca
programVersion: 5.0.2
elementType: N H C H C O C C O N H C H H H O H H S H C O C H H C H H C H N H H C O O H H
charge: 1
multiplicity: 1
keywords: wB97X-D3BJ Opt Freq def2-TZVPP def2/J RIJCOSX VeryTightSCF
keywords: PAL8 defgrid3 TightOpt
frequency: 0.00 0.00 0.00 0.00 0.00 0.00 27.05 63.73 67.43 73.21 90.19 99.55 102.74 109.26 114.33 128.28 175.38 182.55 197.53 210.83 228.63 242.14 252.68 269.71 277.48 322.51 335.02 353.99 362.04 396.35 421.44 452.88 487.31 523.30 539.24 574.77 578.71 588.91 611.96 636.42 657.08 683.95 698.49 708.61 753.61 770.82 782.77 791.06 827.11 877.57 892.92 899.96 912.36 954.65 958.42 968.97 994.56 1031.23 1043.24 1073.44 1120.93 1131.89 1153.55 1172.05 1175.60 1210.70 1242.91 1253.27 1276.28 1286.80 1299.66 1308.56 1322.97 1359.81 1371.45 1372.90 1381.32 1391.56 1406.15 1413.28 1428.39 1439.41 1457.75 1463.54 1471.56 1498.78 1500.93 1503.77 1507.72 1608.72 1616.90 1689.64 1725.42 1802.15 1821.27 1855.75 2750.27 2871.76 3075.27 3085.57 3093.04 3108.61 3112.92 3121.08 3137.76 3147.65 3160.96 3197.69 3212.15 3488.04 3567.23 3627.23 3637.21 3720.83
frequency: 27.05 63.73 67.43 73.21 90.19 99.55 102.74 109.26 114.33 128.28 175.38 182.55 197.53 210.83 228.63 242.14 252.68 269.71 277.48 322.51 335.02 353.99 362.04 396.35 421.44 452.88 487.31 523.30 539.24 574.77 578.71 588.91 611.96 636.42 657.08 683.95 698.49 708.61 753.61 770.82 782.77 791.06 827.11 877.57 892.92 899.96 912.36 954.65 958.42 968.97 994.56 1031.23 1043.24 1073.44 1120.93 1131.89 1153.55 1172.05 1175.60 1210.70 1242.91 1253.27 1276.28 1286.80 1299.66 1308.56 1322.97 1359.81 1371.45 1372.90 1381.32 1391.56 1406.15 1413.28 1428.39 1439.41 1457.75 1463.54 1471.56 1498.78 1500.93 1503.77 1507.72 1608.72 1616.90 1689.64 1725.42 1802.15 1821.27 1855.75 2750.27 2871.76 3075.27 3085.57 3093.04 3108.61 3112.92 3121.08 3137.76 3147.65 3160.96 3197.69 3212.15 3488.04 3567.23 3627.23 3637.21 3720.83
formula: C10H18N3O6S
InChI: InChI=1S/C10H18N3O6S/c11-5(10(18)19)1-2-7(14)13-6(4-20)9(17)12-3-8(15)16/h5-6,12-13,15,18,20H,1-4H2,11H3
38 atoms
N  -2.238339 0.572665 -2.020735
H  -3.132938 0.238718 -2.347991
C  -1.107031 0.426536 -2.906649
H  -0.228372 0.057733 -2.388684
C  -0.700076 1.681143 -3.669879
O  0.354955 1.739459 -4.2675
C  -2.234906 0.76474 -0.656228
C  -0.927658 1.149284 0.067727
O  -3.249746 0.63857 -0.014114
N  0.001461 0.007707 -0.003611
H  -1.247866 1.263521 1.10491
C  -0.353196 2.490609 -0.398782
H  -0.436768 -0.898319 0.060118
H  0.382025 2.845844 0.315185
H  0.15558 2.412746 -1.358324
O  -1.53805 2.695892 -3.683025
H  -2.26569 2.540854 -3.059308
H  -1.335607 -0.324191 -3.666276
S  -1.64907 3.734258 -0.6263
H  -2.212061 3.606715 0.581745
C  1.342446 0.008144 0.002749
O  2.017313 1.044907 0.0257
C  1.983248 -1.367327 -0.042111
H  1.987353 -1.757176 0.979741
H  1.357524 -2.030286 -0.637244
C  3.424083 -1.401886 -0.576913
H  3.641743 -2.43421 -0.848412
H  4.12673 -1.148666 0.221311
C  3.75934 -0.518631 -1.789862
H  4.573967 -0.967908 -2.361065
N  4.229785 0.830939 -1.326375
H  3.482746 1.147535 -0.648341
H  5.135817 0.779008 -0.867339
C  2.586167 -0.320297 -2.754245
O  1.772205 -1.184884 -2.940854
O  2.60127 0.877178 -3.310075
H  1.757251 1.068358 -3.818435
H  4.271177 1.484273 -2.108971
totalener: -1406.22452174 hartree
nucrepener: 1962.51982447 hartree
electener: -3368.74434620 hartree
oneelecener: -5807.89297402 hartree
twoeener: 2439.14862782 hartree
kineticenergy: 1400.64018296 hartree
exchangeener: -105.325838257956 hartree
correlationener: -7.062619113515 hartree
xcener: -112.388457371471 hartree
temp: 298.15 k
press: 1.00 atm
thermalcorrenthalpy: 0.00094421 hartree
totalenthalpy: -1405.98245497 hartree
totalentropycorr: -0.06418721 hartree
gibbsenthalpy: -1406.04664218 hartree
gibbsminuselec: 0.26382828 hartree
chargesum: 1.0000000
charge: -0.254708 0.212615 -0.076664 0.075288 0.323641 -0.331072 0.115026 0.074529 -0.264929 -0.191860 0.157107 -0.189161 0.192287 0.153291 0.095894 -0.188220 0.234496 0.156138 -0.117028 0.120739 0.272827 -0.439512 -0.176035 0.151417 0.143197 -0.229769 0.135705 0.114510 0.017424 0.163819 -0.061425 0.233891 0.220527 0.288471 -0.298789 -0.328737 0.265146 0.229925
charge: 0.312964 -0.010376 -0.059524 0.017584 -0.428792 0.175916 -0.408079 -0.116162 0.132196 0.355045 0.043608 -0.244444 -0.001990 0.006159 0.005346 0.423883 -0.104946 0.048857 0.525455 -0.136390 -0.356278 0.132524 -0.004177 0.044696 0.034316 0.010439 0.045923 0.032278 -0.042250 0.046075 0.601984 -0.044996 0.038271 -0.464134 0.142204 0.362159 -0.150120 0.034777
qa: -0.2547 0.2126 -0.0767 0.0753 0.3236 -0.3311 0.1150 0.0745 -0.2649 -0.1919 0.1571 -0.1892 0.1923 0.1533 0.0959 -0.1882 0.2345 0.1561 -0.1170 0.1207 0.2728 -0.4395 -0.1760 0.1514 0.1432 -0.2298 0.1357 0.1145 0.0174 0.1638 -0.0614 0.2339 0.2205 0.2885 -0.2988 -0.3287 0.2651 0.2299
va: 3.0099 1.0005 3.9095 1.0479 4.2170 2.1676 4.3985 3.5984 2.2421 3.2331 1.0063 4.0032 1.0027 1.0086 1.0258 2.2957 1.0379 1.0005 2.2101 1.0225 4.1123 2.0550 3.7934 0.9999 1.0146 3.9306 1.0048 1.0076 3.7847 0.9968 3.5843 1.0715 0.9818 4.3664 2.1906 2.1736 1.0851 0.9955
dispcorr: -0.086137552 hartree
energy: -1406.316394837865
dipole: 12.26655 -8.29551 3.97105 -7.76845 5.97412 -1.79433 5.97292 -4.93182 1.04110
magnitude: 4.48026 au
magnitude: 11.38792 debye
zeropoint: 0.31105416 hartree
thermalvibcorrection: 0.01777728 hartree
thermalrotcorrection: 0.00141627 hartree
thermaltrasncorrection: 0.00141627 hartree
thermaltotal: -1405.98473086 hartree
thermalcorr: 0.02060982 hartree
nonthermalcorr: 0.31105416 hartree
totalcorr: 0.33166398 hartree
totalenthalpy: -1405.98378665 hartree
