program: Orca
programVersion: 5.0.2
elementType: N H C H C O C C O N H C H H H O H H S H C O C H H C H H C H N H H C O O H H
charge: 1
multiplicity: 1
keywords: wB97X-D3BJ Opt Freq def2-TZVPP def2/J RIJCOSX VeryTightSCF
keywords: PAL8 defgrid3 TightOpt
frequency: 0.00 0.00 0.00 0.00 0.00 0.00 23.69 41.33 59.78 65.92 78.80 83.45 101.62 114.86 127.18 130.87 134.08 154.59 179.35 190.45 198.17 224.08 228.53 261.03 310.01 335.39 343.24 351.48 368.48 431.29 438.49 452.02 484.92 531.65 545.30 574.22 575.41 581.82 633.70 636.73 647.33 667.92 712.59 749.74 764.01 772.13 801.01 819.91 824.13 886.87 900.19 910.46 940.21 951.56 962.31 973.65 983.93 1025.49 1050.05 1058.57 1095.07 1139.24 1170.48 1178.92 1187.58 1224.34 1230.49 1241.73 1256.49 1283.26 1288.38 1295.48 1339.79 1369.84 1373.22 1378.94 1392.80 1400.41 1417.00 1424.38 1436.20 1445.32 1466.93 1484.28 1492.43 1495.16 1504.23 1505.87 1532.26 1611.26 1624.70 1712.14 1719.75 1790.16 1806.11 1861.14 2727.73 2767.02 3040.55 3080.69 3099.24 3115.99 3120.05 3120.28 3143.91 3157.67 3176.45 3185.43 3221.44 3497.83 3571.27 3633.89 3664.18 3789.80
frequency: 23.69 41.33 59.78 65.92 78.80 83.45 101.62 114.86 127.18 130.87 134.08 154.59 179.35 190.45 198.17 224.08 228.53 261.03 310.01 335.39 343.24 351.48 368.48 431.29 438.49 452.02 484.92 531.65 545.30 574.22 575.41 581.82 633.70 636.73 647.33 667.92 712.59 749.74 764.01 772.13 801.01 819.91 824.13 886.87 900.19 910.46 940.21 951.56 962.31 973.65 983.93 1025.49 1050.05 1058.57 1095.07 1139.24 1170.48 1178.92 1187.58 1224.34 1230.49 1241.73 1256.49 1283.26 1288.38 1295.48 1339.79 1369.84 1373.22 1378.94 1392.80 1400.41 1417.00 1424.38 1436.20 1445.32 1466.93 1484.28 1492.43 1495.16 1504.23 1505.87 1532.26 1611.26 1624.70 1712.14 1719.75 1790.16 1806.11 1861.14 2727.73 2767.02 3040.55 3080.69 3099.24 3115.99 3120.05 3120.28 3143.91 3157.67 3176.45 3185.43 3221.44 3497.83 3571.27 3633.89 3664.18 3789.80
formula: C10H18N3O6S
InChI: InChI=1S/C10H18N3O6S/c11-5(10(18)19)1-2-7(14)13-6(4-20)9(17)12-3-8(15)16/h5-6,12-13,15,18,20H,1-4H2,11H3
38 atoms
N  -0.94724 2.271423 -2.163537
H  -1.467745 2.334318 -3.025831
C  0.330536 2.946086 -2.123176
H  0.259017 3.940198 -1.662826
C  0.88776 3.190073 -3.509697
O  2.071897 3.262809 -3.763595
C  -1.456374 1.341879 -1.310294
C  -0.876679 1.125016 0.106182
O  -2.414384 0.665371 -1.621649
N  0.052376 -0.01421 0.086301
H  -1.750555 0.747123 0.638301
C  -0.397081 2.343757 0.885945
H  -0.396899 -0.914193 0.044151
H  0.506326 2.784015 0.483651
H  -1.206129 3.074088 0.860133
O  -0.050558 3.391606 -4.423606
H  0.370619 3.563064 -5.278064
H  1.068102 2.372945 -1.568193
S  -0.102558 1.820741 2.59986
H  0.151205 3.038335 3.08939
C  1.381175 -0.005772 0.09106
O  2.065073 1.03351 0.076455
C  2.079537 -1.350819 0.152403
H  2.664661 -1.334086 1.076812
H  1.36595 -2.167123 0.261058
C  2.984515 -1.661048 -1.056543
H  2.372399 -1.972598 -1.902681
H  3.619932 -2.508617 -0.792711
C  3.85588 -0.521218 -1.576798
H  4.659919 -0.922522 -2.197237
N  4.481972 0.263585 -0.460587
H  3.645485 0.708711 0.030543
H  5.026299 -0.320667 0.169219
C  3.071669 0.47778 -2.43936
O  2.026468 0.203442 -2.96191
O  3.715429 1.632433 -2.522208
H  3.164376 2.297655 -3.021071
H  5.069639 1.006369 -0.83736
totalener: -1406.23473795 hartree
nucrepener: 1947.17768304 hartree
electener: -3353.41242098 hartree
oneelecener: -5777.90418690 hartree
twoeener: 2424.49176592 hartree
kineticenergy: 1401.47964351 hartree
exchangeener: -105.477957134915 hartree
correlationener: -7.069081189903 hartree
xcener: -112.547038324818 hartree
temp: 298.15 k
press: 1.00 atm
thermalcorrenthalpy: 0.00094421 hartree
totalenthalpy: -1405.98514062 hartree
totalentropycorr: -0.06897101 hartree
gibbsenthalpy: -1406.05411162 hartree
gibbsminuselec: 0.26420272 hartree
chargesum: 1.0000000
charge: -0.173184 0.189870 -0.064059 0.145338 0.343594 -0.339587 0.169497 -0.016416 -0.312053 -0.136140 0.165183 -0.162345 0.196978 0.113441 0.145636 -0.247278 0.249105 0.094984 -0.150601 0.114949 0.362392 -0.469229 -0.239818 0.133465 0.109255 -0.197293 0.138593 0.138174 -0.001385 0.165294 -0.073972 0.232568 0.219212 0.288872 -0.298085 -0.337116 0.267183 0.234977
charge: 0.324067 -0.011848 -0.047999 0.037587 -0.394932 0.167071 -0.382155 -0.128920 0.105948 0.371543 0.050563 -0.233015 0.002933 -0.012174 0.015187 0.401973 -0.065451 0.023506 0.481928 -0.144740 -0.356431 0.123761 0.001829 0.036820 0.037288 0.004924 0.045855 0.033807 -0.050626 0.045857 0.599158 -0.040424 0.037289 -0.465486 0.141262 0.356811 -0.151958 0.039194
qa: -0.1732 0.1899 -0.0641 0.1453 0.3436 -0.3396 0.1695 -0.0164 -0.3121 -0.1361 0.1652 -0.1623 0.1970 0.1134 0.1456 -0.2473 0.2491 0.0950 -0.1506 0.1149 0.3624 -0.4692 -0.2398 0.1335 0.1093 -0.1973 0.1386 0.1382 -0.0014 0.1653 -0.0740 0.2326 0.2192 0.2889 -0.2981 -0.3371 0.2672 0.2350
va: 3.0660 1.0308 3.8915 0.9871 4.2794 2.1500 4.3873 3.7230 2.2065 3.2628 1.0142 3.9925 1.0056 1.0127 0.9987 2.2576 1.0111 1.0080 2.1609 1.0210 4.0179 2.0142 3.8870 1.0091 1.0235 3.8409 1.0214 1.0012 3.8344 0.9966 3.5722 1.0776 0.9806 4.3509 2.1895 2.1742 1.0815 0.9880
dispcorr: -0.083576259 hartree
energy: -1406.318314299035
dipole: 8.89220 -5.03725 3.85495 -5.33951 4.42815 -0.91136 5.53951 -5.01000 0.52952
magnitude: 3.99645 au
magnitude: 10.15816 debye
zeropoint: 0.31138723 hartree
thermalvibcorrection: 0.01801010 hartree
thermalrotcorrection: 0.00141627 hartree
thermaltrasncorrection: 0.00141627 hartree
thermaltotal: -1405.98608442 hartree
thermalcorr: 0.02084265 hartree
nonthermalcorr: 0.31138723 hartree
totalcorr: 0.33222988 hartree
totalenthalpy: -1405.98514021 hartree
