program: Orca
programVersion: 5.0.2
elementType: N H C H C O C C O N H C H H H O H H S H C O C H H C H H C H N H H C O O H H
charge: 1
multiplicity: 1
keywords: wB97X-D3BJ Opt Freq def2-TZVPP def2/J RIJCOSX VeryTightSCF
keywords: PAL8 defgrid3 TightOpt
frequency: 0.00 0.00 0.00 0.00 0.00 0.00 13.44 17.54 25.14 34.22 45.29 50.63 60.02 70.19 92.68 100.46 125.60 141.92 157.56 164.90 182.12 205.83 217.84 246.35 264.89 276.88 302.34 318.49 322.42 363.89 415.92 423.36 478.23 523.77 534.52 574.49 593.72 618.20 630.38 649.73 661.42 683.06 696.89 708.59 747.95 757.10 759.78 793.48 804.03 819.55 851.47 865.16 910.94 969.43 981.42 984.73 995.73 1001.84 1033.87 1070.37 1106.98 1110.65 1152.85 1167.89 1174.48 1210.34 1211.34 1224.52 1257.30 1283.75 1288.85 1296.58 1304.03 1339.19 1352.27 1359.20 1361.67 1385.80 1395.68 1419.53 1430.99 1459.92 1465.67 1472.18 1484.39 1495.42 1497.46 1515.57 1516.65 1619.82 1641.14 1674.20 1776.08 1798.79 1818.89 1841.80 2748.50 3056.08 3081.13 3089.78 3098.10 3106.35 3131.26 3147.32 3155.82 3157.14 3190.22 3307.06 3492.06 3504.19 3546.00 3627.47 3776.01 3797.79
frequency: 13.44 17.54 25.14 34.22 45.29 50.63 60.02 70.19 92.68 100.46 125.60 141.92 157.56 164.90 182.12 205.83 217.84 246.35 264.89 276.88 302.34 318.49 322.42 363.89 415.92 423.36 478.23 523.77 534.52 574.49 593.72 618.20 630.38 649.73 661.42 683.06 696.89 708.59 747.95 757.10 759.78 793.48 804.03 819.55 851.47 865.16 910.94 969.43 981.42 984.73 995.73 1001.84 1033.87 1070.37 1106.98 1110.65 1152.85 1167.89 1174.48 1210.34 1211.34 1224.52 1257.30 1283.75 1288.85 1296.58 1304.03 1339.19 1352.27 1359.20 1361.67 1385.80 1395.68 1419.53 1430.99 1459.92 1465.67 1472.18 1484.39 1495.42 1497.46 1515.57 1516.65 1619.82 1641.14 1674.20 1776.08 1798.79 1818.89 1841.80 2748.50 3056.08 3081.13 3089.78 3098.10 3106.35 3131.26 3147.32 3155.82 3157.14 3190.22 3307.06 3492.06 3504.19 3546.00 3627.47 3776.01 3797.79
formula: C10H18N3O6S
InChI: InChI=1S/C10H18N3O6S/c11-5(10(18)19)1-2-7(14)13-6(4-20)9(17)12-3-8(15)16/h5-6,12-13,15,18,20H,1-4H2,11H3
38 atoms
N  -2.85141 -0.16914 -0.194684
H  -3.809262 -0.196975 0.121971
C  -2.563071 -0.957514 -1.375468
H  -3.446035 -1.002964 -2.012013
C  -2.116724 -2.370531 -1.03632
O  -1.183387 -2.633853 -0.310825
C  -2.217596 0.945229 0.302862
C  -0.729213 1.210193 0.064764
O  -2.828879 1.732151 0.992511
N  0.050677 0.001407 -0.159525
H  -0.401845 1.662175 1.005068
C  -0.52624 2.296965 -0.999888
H  -0.401066 -0.90236 -0.07321
H  -1.08077 3.182505 -0.694798
H  0.52958 2.555345 -1.026529
O  -2.84452 -3.302077 -1.650395
H  -2.498276 -4.171777 -1.407325
H  -1.768195 -0.490028 -1.958863
S  -0.975604 1.859127 -2.695251
H  -2.285719 2.116388 -2.600439
C  1.393624 0.020795 -0.065228
O  2.065092 1.036407 0.027451
C  2.057778 -1.359747 -0.045328
H  2.07643 -1.679954 1.001062
H  1.460111 -2.091404 -0.587323
C  3.476388 -1.236647 -0.591838
H  3.853069 -0.260469 -0.2696
H  3.468066 -1.244248 -1.686497
C  4.435268 -2.313053 -0.086924
H  4.462203 -2.334835 1.002234
N  5.822791 -2.004641 -0.597965
H  5.943735 -2.565555 -1.457624
H  5.929735 -1.0110 -0.802817
C  4.131233 -3.698612 -0.649895
O  4.76784 -4.153456 -1.567359
O  3.116463 -4.2792 -0.039108
H  2.939644 -5.139558 -0.448632
H  6.552349 -2.283983 0.057573
totalener: -1406.21202215 hartree
nucrepener: 1796.61301490 hartree
electener: -3202.82503706 hartree
oneelecener: -5478.90126156 hartree
twoeener: 2276.07622450 hartree
kineticenergy: 1400.61967918 hartree
exchangeener: -105.312252956786 hartree
correlationener: -7.049192134150 hartree
xcener: -112.361445090936 hartree
temp: 298.15 k
press: 1.00 atm
thermalcorrenthalpy: 0.00094421 hartree
totalenthalpy: -1405.95910529 hartree
totalentropycorr: -0.06715519 hartree
gibbsenthalpy: -1406.02626048 hartree
gibbsminuselec: 0.26260366 hartree
chargesum: 1.0000000
charge: -0.217245 0.188175 -0.094580 0.144397 0.317606 -0.360978 0.173169 0.056448 -0.307081 -0.220836 0.131335 -0.172297 0.193831 0.153926 0.141458 -0.238663 0.236467 0.119050 -0.176565 0.114374 0.259086 -0.398710 -0.203234 0.123185 0.105738 -0.178728 0.118663 0.126244 -0.010483 0.160508 -0.042303 0.238776 0.240725 0.299764 -0.296479 -0.227412 0.259253 0.243417
charge: 0.310391 -0.010624 -0.062762 0.032909 -0.421770 0.103683 -0.378081 -0.130911 0.111726 0.332839 0.049354 -0.234437 -0.054588 0.018008 0.008384 0.386507 -0.080558 0.007235 0.493221 -0.148675 -0.380795 0.077983 -0.002305 0.037900 0.025562 -0.009600 0.031191 0.035464 -0.039646 0.046261 0.620370 0.042816 0.056459 -0.435611 0.141440 0.420414 -0.057855 0.058100
qa: -0.2172 0.1882 -0.0946 0.1444 0.3176 -0.3610 0.1732 0.0564 -0.3071 -0.2208 0.1313 -0.1723 0.1938 0.1539 0.1415 -0.2387 0.2365 0.1190 -0.1766 0.1144 0.2591 -0.3987 -0.2032 0.1232 0.1057 -0.1787 0.1187 0.1262 -0.0105 0.1605 -0.0423 0.2388 0.2407 0.2998 -0.2965 -0.2274 0.2593 0.2434
va: 3.0342 1.0173 3.7490 1.0101 4.2567 2.1238 4.3803 3.7499 2.2209 3.1622 1.0342 3.8610 1.0613 1.0103 1.0216 2.2631 1.0196 1.0808 2.1728 1.0211 4.2715 2.1209 3.9024 1.0098 1.0401 3.8434 1.0488 1.0016 3.8482 1.0009 3.6451 1.0112 0.9721 4.3140 2.1922 2.2951 1.0009 0.9702
dispcorr: -0.077322789 hartree
energy: -1406.294745195502
dipole: 10.90846 -4.87079 6.03767 -0.69901 -3.12553 -3.82454 0.27868 -0.45631 -0.17762
magnitude: 7.14928 au
magnitude: 18.17202 debye
zeropoint: 0.31043206 hartree
thermalvibcorrection: 0.01931274 hartree
thermalrotcorrection: 0.00141627 hartree
thermaltrasncorrection: 0.00141627 hartree
thermaltotal: -1405.96216786 hartree
thermalcorr: 0.02214528 hartree
nonthermalcorr: 0.31043206 hartree
totalcorr: 0.33257734 hartree
totalenthalpy: -1405.96122365 hartree
