program: Orca
programVersion: 5.0.2
elementType: N H C H C O C C O N H C H H H O H H S H C O C H H C H H C H N H H C O O H H
charge: 1
multiplicity: 1
keywords: wB97X-D3BJ Opt Freq def2-TZVPP def2/J RIJCOSX VeryTightSCF
keywords: PAL8 defgrid3 TightOpt
frequency: 0.00 0.00 0.00 0.00 0.00 0.00 18.86 22.80 30.12 32.91 40.15 60.69 68.78 82.94 90.66 99.44 123.53 136.27 156.15 194.71 208.05 231.86 253.72 257.90 266.06 280.99 289.63 328.08 343.90 377.58 402.11 416.70 448.78 507.76 513.20 535.44 552.66 568.79 602.65 624.37 632.09 655.66 672.40 714.70 736.98 754.60 775.49 779.57 782.10 792.24 862.12 876.02 890.33 933.28 963.66 984.40 1002.33 1033.34 1059.72 1093.33 1099.54 1116.72 1128.25 1158.78 1192.02 1196.05 1202.48 1216.39 1239.07 1272.38 1278.94 1299.93 1304.83 1326.96 1339.20 1347.18 1356.81 1369.79 1384.66 1392.88 1412.53 1436.95 1443.03 1475.44 1493.61 1505.96 1507.09 1512.33 1541.19 1574.24 1655.12 1689.03 1782.14 1819.51 1835.94 1908.43 2751.14 3060.74 3074.93 3096.57 3110.81 3113.49 3144.11 3146.15 3158.54 3162.32 3162.76 3227.38 3479.14 3551.70 3625.57 3664.53 3784.46 3806.53
frequency: 18.86 22.80 30.12 32.91 40.15 60.69 68.78 82.94 90.66 99.44 123.53 136.27 156.15 194.71 208.05 231.86 253.72 257.90 266.06 280.99 289.63 328.08 343.90 377.58 402.11 416.70 448.78 507.76 513.20 535.44 552.66 568.79 602.65 624.37 632.09 655.66 672.40 714.70 736.98 754.60 775.49 779.57 782.10 792.24 862.12 876.02 890.33 933.28 963.66 984.40 1002.33 1033.34 1059.72 1093.33 1099.54 1116.72 1128.25 1158.78 1192.02 1196.05 1202.48 1216.39 1239.07 1272.38 1278.94 1299.93 1304.83 1326.96 1339.20 1347.18 1356.81 1369.79 1384.66 1392.88 1412.53 1436.95 1443.03 1475.44 1493.61 1505.96 1507.09 1512.33 1541.19 1574.24 1655.12 1689.03 1782.14 1819.51 1835.94 1908.43 2751.14 3060.74 3074.93 3096.57 3110.81 3113.49 3144.11 3146.15 3158.54 3162.32 3162.76 3227.38 3479.14 3551.70 3625.57 3664.53 3784.46 3806.53
formula: C10H18N3O6S
InChI: InChI=1S/C10H18N3O6S/c11-5(10(18)19)1-2-7(14)13-6(4-20)9(17)12-3-8(15)16/h5-6,12-13,15,18,20H,1-4H2,11H3
38 atoms
N  -1.959078 -0.22971 2.161867
H  -2.143357 -0.272653 3.15323
C  -2.952152 -0.847713 1.328248
H  -3.920258 -0.883927 1.831432
C  -2.619076 -2.260842 0.882634
O  -1.508748 -2.764227 0.869958
C  -1.220883 0.908133 1.863716
C  -0.776902 1.174572 0.412929
O  -0.8122 1.605444 2.76019
N  -0.08164 0.007784 -0.108343
H  -0.024245 1.952613 0.526585
C  -1.855474 1.679864 -0.553777
H  -0.58076 -0.864933 -0.073492
H  -1.38183 2.287859 -1.323152
H  -2.340865 0.85202 -1.073968
O  -3.700092 -2.891624 0.453612
H  -3.466038 -3.77012 0.125302
H  -3.134399 -0.270613 0.421261
S  -3.190921 2.592263 0.253594
H  -2.417593 3.449597 0.931286
C  1.285186 -0.093621 -0.019627
O  2.030331 0.845907 0.113798
C  1.783211 -1.533638 -0.000928
H  1.122445 -2.156327 -0.613466
H  2.786105 -1.564901 -0.425986
C  1.793245 -1.973192 1.46919
H  0.851807 -1.693347 1.953075
H  2.588981 -1.45464 2.003169
C  2.005789 -3.466734 1.664876
H  2.928974 -3.801708 1.185796
N  0.876703 -4.243911 1.027065
H  -0.022072 -3.733521 1.104688
H  1.053177 -4.389488 0.035021
C  2.123512 -3.824144 3.145858
O  2.811649 -3.216681 3.902172
O  1.386558 -4.909551 3.46399
H  1.524381 -5.115863 4.399913
H  0.774748 -5.15225 1.482838
totalener: -1406.20656867 hartree
nucrepener: 1852.70574770 hartree
electener: -3258.91231637 hartree
oneelecener: -5588.83713021 hartree
twoeener: 2329.92481384 hartree
kineticenergy: 1400.62394294 hartree
exchangeener: -105.307916484998 hartree
correlationener: -7.048594587810 hartree
xcener: -112.356511072808 hartree
temp: 298.15 k
press: 1.00 atm
thermalcorrenthalpy: 0.00094421 hartree
totalenthalpy: -1405.95623189 hartree
totalentropycorr: -0.06679155 hartree
gibbsenthalpy: -1406.02302344 hartree
gibbsminuselec: 0.26273078 hartree
chargesum: 1.0000000
charge: -0.221510 0.184073 -0.116732 0.169650 0.368195 -0.438493 0.126207 0.082676 -0.270238 -0.234846 0.152366 -0.146035 0.154432 0.140681 0.078230 -0.208793 0.235658 0.131708 -0.135670 0.126789 0.213045 -0.306112 -0.181193 0.072351 0.140702 -0.195794 0.100534 0.167240 -0.008612 0.156713 -0.057825 0.239303 0.229750 0.284932 -0.222968 -0.299098 0.257437 0.231248
charge: 0.296231 -0.014724 -0.059840 0.047229 -0.401972 0.078877 -0.392067 -0.134478 0.129702 0.320638 0.050336 -0.250295 -0.045047 0.012384 -0.003017 0.414591 -0.075814 0.038458 0.500787 -0.134229 -0.383423 0.129611 -0.010606 0.010612 0.038818 -0.002858 0.033414 0.054675 -0.040272 0.050480 0.611986 -0.001994 0.046488 -0.428426 0.188916 0.353132 -0.064825 0.036520
qa: -0.2215 0.1841 -0.1167 0.1696 0.3682 -0.4385 0.1262 0.0827 -0.2702 -0.2348 0.1524 -0.1460 0.1544 0.1407 0.0782 -0.2088 0.2357 0.1317 -0.1357 0.1268 0.2130 -0.3061 -0.1812 0.0724 0.1407 -0.1958 0.1005 0.1672 -0.0086 0.1567 -0.0578 0.2393 0.2297 0.2849 -0.2230 -0.2991 0.2574 0.2312
va: 2.9709 1.0233 3.8662 1.0068 4.1733 2.0194 4.3796 3.6191 2.2356 3.1381 1.0432 3.9959 1.0421 1.0030 1.0054 2.3021 1.0222 1.0222 2.1915 1.0212 4.3555 2.2213 3.8352 1.0236 1.0276 3.8336 1.0413 1.0244 3.7824 1.0025 3.5983 1.0540 0.9757 4.3538 2.2787 2.1772 1.0053 0.9952
dispcorr: -0.079693400 hartree
energy: -1406.291895908118
dipole: 1.59777 -1.94562 -0.34785 -8.12414 1.80315 -6.32099 -5.74625 4.85661 -0.88964
magnitude: 6.39276 au
magnitude: 16.24911 debye
zeropoint: 0.31005608 hartree
thermalvibcorrection: 0.01924351 hartree
thermalrotcorrection: 0.00141627 hartree
thermaltrasncorrection: 0.00141627 hartree
thermaltotal: -1405.95976377 hartree
thermalcorr: 0.02207606 hartree
nonthermalcorr: 0.31005608 hartree
totalcorr: 0.33213214 hartree
totalenthalpy: -1405.95881956 hartree
