program: Orca
programVersion: 5.0.2
elementType: N H C H C O C C O N H C H H H O H H S H C O C H H C H H C H N H H C O O H H
charge: 1
multiplicity: 1
keywords: wB97X-D3BJ Opt Freq def2-TZVPP def2/J RIJCOSX VeryTightSCF
keywords: PAL8 defgrid3 TightOpt
frequency: 0.00 0.00 0.00 0.00 0.00 0.00 20.93 32.55 44.23 46.21 49.78 58.17 81.63 107.96 116.57 138.41 160.85 164.14 189.18 196.85 204.76 236.71 250.82 255.77 291.67 306.86 345.55 362.42 384.16 387.40 434.56 464.06 466.63 516.77 531.47 545.74 563.05 588.05 606.66 633.65 655.98 666.70 671.67 716.43 728.72 746.82 769.44 818.14 836.90 854.67 881.00 887.09 912.18 934.03 970.99 984.51 1019.61 1038.80 1055.33 1084.68 1110.75 1137.78 1157.01 1172.51 1184.23 1201.23 1206.31 1227.32 1241.28 1280.31 1288.20 1296.93 1303.64 1319.44 1340.53 1351.49 1364.25 1401.94 1407.78 1416.93 1422.96 1447.75 1457.27 1483.66 1491.44 1498.25 1506.54 1523.94 1571.56 1587.54 1635.78 1691.40 1716.38 1754.25 1838.77 1892.50 2762.71 2972.23 3090.94 3093.90 3099.39 3109.37 3111.22 3126.42 3144.33 3162.57 3166.65 3169.76 3340.32 3517.48 3623.70 3645.16 3793.52 3794.30
frequency: 20.93 32.55 44.23 46.21 49.78 58.17 81.63 107.96 116.57 138.41 160.85 164.14 189.18 196.85 204.76 236.71 250.82 255.77 291.67 306.86 345.55 362.42 384.16 387.40 434.56 464.06 466.63 516.77 531.47 545.74 563.05 588.05 606.66 633.65 655.98 666.70 671.67 716.43 728.72 746.82 769.44 818.14 836.90 854.67 881.00 887.09 912.18 934.03 970.99 984.51 1019.61 1038.80 1055.33 1084.68 1110.75 1137.78 1157.01 1172.51 1184.23 1201.23 1206.31 1227.32 1241.28 1280.31 1288.20 1296.93 1303.64 1319.44 1340.53 1351.49 1364.25 1401.94 1407.78 1416.93 1422.96 1447.75 1457.27 1483.66 1491.44 1498.25 1506.54 1523.94 1571.56 1587.54 1635.78 1691.40 1716.38 1754.25 1838.77 1892.50 2762.71 2972.23 3090.94 3093.90 3099.39 3109.37 3111.22 3126.42 3144.33 3162.57 3166.65 3169.76 3340.32 3517.48 3623.70 3645.16 3793.52 3794.30
formula: C10H18N3O6S
InChI: InChI=1S/C10H18N3O6S/c11-5(10(18)19)1-2-7(14)13-6(4-20)9(17)12-3-8(15)16/h5-6,12-13,15,18,20H,1-4H2,11H3
38 atoms
N  -2.491354 1.156847 2.122889
H  -2.563329 1.139343 3.129901
C  -3.659374 0.690403 1.409488
H  -4.510246 0.729495 2.088639
C  -3.505231 -0.735847 0.904424
O  -2.459059 -1.333309 0.853177
C  -1.203145 1.170366 1.726029
C  -0.75372 1.222758 0.254522
O  -0.31889 1.189052 2.587016
N  0.021616 0.020242 0.019112
H  -0.032547 2.043608 0.245928
C  -1.767046 1.500428 -0.850645
H  -0.466522 -0.857987 0.100867
H  -2.410499 0.642368 -1.033445
H  -2.370488 2.366531 -0.57827
O  -4.671703 -1.224615 0.495422
H  -4.538637 -2.121842 0.158581
H  -3.918689 1.325446 0.563083
S  -0.8261 1.870883 -2.358756
H  -1.890315 2.082959 -3.140212
C  1.369013 0.041932 -0.010316
O  2.016164 1.085617 -0.038936
C  2.065573 -1.296482 0.120481
H  1.350446 -2.093274 0.335002
H  2.54983 -1.529769 -0.829411
C  3.133616 -1.225241 1.218365
H  3.952624 -0.576193 0.899727
H  3.549664 -2.219392 1.376721
C  2.614075 -0.740194 2.580031
H  1.662159 -1.223663 2.812674
N  2.367399 0.745208 2.606406
H  2.821056 1.167415 3.415261
H  2.705905 1.171643 1.733233
C  3.577875 -1.164108 3.687554
O  3.93727 -2.29297 3.827011
O  3.949411 -0.138741 4.477263
H  4.543986 -0.475392 5.162378
H  1.340501 0.960816 2.624549
totalener: -1406.24293026 hartree
nucrepener: 1854.57853243 hartree
electener: -3260.82146269 hartree
oneelecener: -5593.15379315 hartree
twoeener: 2332.33233046 hartree
kineticenergy: 1400.66491017 hartree
exchangeener: -105.329659259840 hartree
correlationener: -7.055412118560 hartree
xcener: -112.385071378400 hartree
temp: 298.15 k
press: 1.00 atm
thermalcorrenthalpy: 0.00094421 hartree
totalenthalpy: -1405.99371536 hartree
totalentropycorr: -0.06549806 hartree
gibbsenthalpy: -1406.05921341 hartree
gibbsminuselec: 0.26412576 hartree
chargesum: 1.0000000
charge: -0.158509 0.192712 -0.098920 0.159184 0.318357 -0.350609 0.255551 0.059071 -0.429209 -0.172150 0.154534 -0.204277 0.198979 0.107772 0.126086 -0.239695 0.248470 0.136941 -0.120682 0.116614 0.196681 -0.398439 -0.151041 0.101198 0.132659 -0.215693 0.130041 0.138623 0.006582 0.141104 -0.052183 0.214722 0.223816 0.288747 -0.251673 -0.286508 0.252481 0.228664
charge: 0.343633 0.000657 -0.041532 0.046557 -0.440808 0.110246 -0.330687 -0.142962 0.106109 0.352812 0.046871 -0.241888 -0.024641 -0.000927 0.006590 0.395743 -0.071500 0.036097 0.499170 -0.144903 -0.383256 0.080929 0.000948 0.029369 0.045654 0.006120 0.035676 0.043643 -0.040346 0.047894 0.603326 0.018214 0.011904 -0.427078 0.166767 0.362570 -0.067656 -0.039316
qa: -0.1585 0.1927 -0.0989 0.1592 0.3184 -0.3506 0.2556 0.0591 -0.4292 -0.1722 0.1545 -0.2043 0.1990 0.1078 0.1261 -0.2397 0.2485 0.1369 -0.1207 0.1166 0.1967 -0.3984 -0.1510 0.1012 0.1327 -0.2157 0.1300 0.1386 0.0066 0.1411 -0.0522 0.2147 0.2238 0.2887 -0.2517 -0.2865 0.2525 0.2287
va: 3.1866 1.0131 3.8542 1.0021 4.2614 2.1215 4.2825 3.6477 2.0763 3.1789 1.0505 4.0817 1.0212 1.0128 0.9999 2.2683 1.0103 1.0022 2.1730 1.0204 4.2376 2.0982 3.8332 1.0192 1.0102 3.9107 1.0078 1.0243 3.8051 1.0143 3.5424 1.0086 1.0279 4.3319 2.2551 2.1885 1.0075 1.0894
dispcorr: -0.081128978 hartree
energy: -1406.328703680195
dipole: -0.23381 -0.52153 -0.75534 0.11402 -0.22206 -0.10803 -0.42958 1.94676 1.51718
magnitude: 1.69825 au
magnitude: 4.31660 debye
zeropoint: 0.31136115 hartree
thermalvibcorrection: 0.01834153 hartree
thermalrotcorrection: 0.00141627 hartree
thermaltrasncorrection: 0.00141627 hartree
thermaltotal: -1405.99616846 hartree
thermalcorr: 0.02117407 hartree
nonthermalcorr: 0.31136115 hartree
totalcorr: 0.33253522 hartree
totalenthalpy: -1405.99522425 hartree
