program: Orca
programVersion: 5.0.2
elementType: N H C H C O C C O N H C H H H O H H S H C O C H H C H H C H N H H C O O H H
charge: 1
multiplicity: 1
keywords: wB97X-D3BJ Opt Freq def2-TZVPP def2/J RIJCOSX VeryTightSCF
keywords: PAL8 defgrid3 TightOpt
frequency: 0.00 0.00 0.00 0.00 0.00 0.00 17.76 26.43 32.24 39.15 47.74 59.69 86.04 90.15 118.29 123.69 146.12 174.23 177.02 193.76 246.91 275.69 283.86 290.93 302.78 343.89 351.71 375.40 404.59 410.55 414.16 441.59 485.56 505.12 512.63 528.45 574.68 576.21 596.48 610.10 635.20 644.66 662.41 672.88 710.88 738.38 752.78 767.14 804.48 818.93 852.00 878.26 928.11 942.83 978.14 984.60 1001.81 1020.71 1052.53 1068.21 1109.01 1150.85 1154.03 1174.36 1186.00 1187.37 1214.18 1236.13 1265.82 1280.86 1288.52 1300.13 1322.36 1331.75 1348.31 1356.86 1375.97 1382.04 1403.88 1431.17 1436.76 1447.57 1458.97 1469.75 1482.68 1493.77 1502.33 1513.73 1528.90 1602.24 1647.93 1690.16 1736.99 1794.16 1856.12 1862.79 2609.26 2755.16 3065.87 3083.49 3093.32 3099.31 3103.96 3107.92 3142.44 3147.29 3156.09 3199.94 3497.41 3554.23 3648.64 3689.38 3786.36 3802.54
frequency: 17.76 26.43 32.24 39.15 47.74 59.69 86.04 90.15 118.29 123.69 146.12 174.23 177.02 193.76 246.91 275.69 283.86 290.93 302.78 343.89 351.71 375.40 404.59 410.55 414.16 441.59 485.56 505.12 512.63 528.45 574.68 576.21 596.48 610.10 635.20 644.66 662.41 672.88 710.88 738.38 752.78 767.14 804.48 818.93 852.00 878.26 928.11 942.83 978.14 984.60 1001.81 1020.71 1052.53 1068.21 1109.01 1150.85 1154.03 1174.36 1186.00 1187.37 1214.18 1236.13 1265.82 1280.86 1288.52 1300.13 1322.36 1331.75 1348.31 1356.86 1375.97 1382.04 1403.88 1431.17 1436.76 1447.57 1458.97 1469.75 1482.68 1493.77 1502.33 1513.73 1528.90 1602.24 1647.93 1690.16 1736.99 1794.16 1856.12 1862.79 2609.26 2755.16 3065.87 3083.49 3093.32 3099.31 3103.96 3107.92 3142.44 3147.29 3156.09 3199.94 3497.41 3554.23 3648.64 3689.38 3786.36 3802.54
formula: C10H18N3O6S
InChI: InChI=1S/C10H18N3O6S/c11-5(10(18)19)1-2-7(14)13-6(4-20)9(17)12-3-8(15)16/h5-6,12-13,15,18,20H,1-4H2,11H3
38 atoms
N  -0.663357 3.398231 -1.465573
H  -0.264523 3.779044 -2.309099
C  -1.622938 4.219311 -0.778302
H  -2.071202 4.907557 -1.498039
C  -1.017431 5.068028 0.331629
O  0.149169 5.117239 0.608596
C  -0.258726 2.114714 -1.267296
C  -0.754788 1.304058 -0.038941
O  0.413657 1.551141 -2.103417
N  0.035781 0.083161 0.062558
H  -1.753058 0.976867 -0.351601
C  -0.960214 1.933881 1.351539
H  -0.447381 -0.789809 -0.053632
H  -1.585139 2.818636 1.295322
H  -1.529177 1.209945 1.938101
O  -1.973953 5.762981 0.961469
H  -1.554969 6.309174 1.640404
H  -2.45624 3.641266 -0.378823
S  0.47183 2.287123 2.389643
H  1.019644 3.230337 1.614609
C  1.374193 0.041014 0.056782
O  2.088196 1.047343 0.042539
C  2.017097 -1.33185 0.140225
H  1.319192 -2.125691 -0.126116
H  2.807106 -1.34576 -0.613347
C  2.592404 -1.635977 1.540026
H  3.285583 -2.476866 1.454925
H  1.796757 -1.956562 2.212215
C  3.287352 -0.455203 2.226895
H  2.538141 0.277371 2.542068
N  4.191187 0.271895 1.289726
H  4.846461 -0.358065 0.830823
H  3.521883 0.732301 0.586033
C  4.110274 -0.862275 3.437457
O  5.264544 -0.554166 3.568369
O  3.392776 -1.569634 4.304331
H  3.948461 -1.787304 5.066771
H  4.749454 0.956975 1.798257
totalener: -1406.22998877 hartree
nucrepener: 1869.10983866 hartree
electener: -3275.33982743 hartree
oneelecener: -5622.88802751 hartree
twoeener: 2347.54820008 hartree
kineticenergy: 1401.48570117 hartree
exchangeener: -105.470660964544 hartree
correlationener: -7.064773692517 hartree
xcener: -112.535434657061 hartree
temp: 298.15 k
press: 1.00 atm
thermalcorrenthalpy: 0.00094421 hartree
totalenthalpy: -1405.97861165 hartree
totalentropycorr: -0.06996945 hartree
gibbsenthalpy: -1406.04858110 hartree
gibbsminuselec: 0.26275423 hartree
chargesum: 1.0000000
charge: -0.166174 0.191340 -0.145499 0.150875 0.304689 -0.309540 0.227392 0.007894 -0.329641 -0.145905 0.134668 -0.173326 0.180757 0.095516 0.135930 -0.258523 0.243538 0.130419 -0.156153 0.142136 0.350911 -0.387805 -0.273722 0.106406 0.142631 -0.192275 0.128741 0.127289 0.010780 0.118347 -0.053024 0.215462 0.227073 0.278887 -0.293879 -0.249197 0.253709 0.229272
charge: 0.332568 -0.004636 -0.062730 0.044957 -0.457196 0.120792 -0.381899 -0.112307 0.104578 0.363750 0.046872 -0.250912 -0.012219 -0.000546 0.015830 0.373614 -0.079412 0.030350 0.497046 -0.143780 -0.358331 0.158233 0.000454 0.034109 0.037053 0.002349 0.036393 0.041674 -0.064617 0.033171 0.602493 0.042766 -0.055437 -0.441741 0.131451 0.396490 -0.065523 0.044293
qa: -0.1662 0.1913 -0.1455 0.1509 0.3047 -0.3095 0.2274 0.0079 -0.3296 -0.1459 0.1347 -0.1733 0.1808 0.0955 0.1359 -0.2585 0.2435 0.1304 -0.1562 0.1421 0.3509 -0.3878 -0.2737 0.1064 0.1426 -0.1923 0.1287 0.1273 0.0108 0.1183 -0.0530 0.2155 0.2271 0.2789 -0.2939 -0.2492 0.2537 0.2293
va: 3.1151 1.0171 3.8628 1.0001 4.2707 2.1797 4.3506 3.7461 2.1929 3.2469 0.9926 4.0051 1.0128 1.0186 1.0003 2.2231 1.0138 0.9990 2.1828 1.0263 4.0954 2.1054 3.8673 1.0224 1.0108 3.8102 1.0059 1.0194 3.7566 1.0941 3.5986 0.9915 1.0921 4.4125 2.2033 2.2483 1.0056 0.9885
dispcorr: -0.081338166 hartree
energy: -1406.311335604401
dipole: -1.40444 1.88586 0.48142 -7.78025 5.65295 -2.12730 -1.39820 2.06062 0.66242
magnitude: 2.27947 au
magnitude: 5.79394 debye
zeropoint: 0.31061809 hartree
thermalvibcorrection: 0.01832595 hartree
thermalrotcorrection: 0.00141627 hartree
thermaltrasncorrection: 0.00141627 hartree
thermaltotal: -1405.97955902 hartree
thermalcorr: 0.02115849 hartree
nonthermalcorr: 0.31061809 hartree
totalcorr: 0.33177658 hartree
totalenthalpy: -1405.97861481 hartree
