program: Orca
programVersion: 5.0.2
elementType: N H C H C O C C O N H C H H H O H H S H C O C H H C H H C H N H H C O O H H
charge: 1
multiplicity: 1
keywords: wB97X-D3BJ Opt Freq def2-TZVPP def2/J RIJCOSX VeryTightSCF
keywords: PAL8 defgrid3 TightOpt
frequency: 0.00 0.00 0.00 0.00 0.00 0.00 28.95 46.61 64.20 87.70 95.59 102.94 114.21 125.26 135.37 146.22 157.07 180.37 182.33 216.16 232.43 251.67 275.97 290.10 293.93 317.42 318.76 333.77 378.78 388.70 409.38 464.23 479.36 519.59 548.13 557.00 581.96 589.23 603.16 618.93 660.94 668.34 691.56 711.20 728.39 738.85 743.07 784.18 808.32 833.15 835.50 907.79 908.45 928.40 958.48 974.57 995.73 1024.27 1067.36 1088.77 1103.48 1135.65 1138.08 1184.72 1189.45 1224.40 1237.08 1253.95 1257.66 1274.23 1286.81 1299.05 1312.39 1357.09 1368.14 1374.70 1379.89 1396.54 1413.83 1423.07 1431.65 1464.72 1476.97 1479.47 1481.54 1484.81 1498.97 1520.96 1569.17 1583.02 1657.74 1685.66 1749.07 1768.96 1807.85 1820.63 2729.11 2747.14 3081.56 3088.78 3097.57 3099.17 3105.89 3109.40 3123.59 3151.43 3170.06 3193.31 3496.64 3562.57 3571.36 3631.08 3634.09 3789.82
frequency: 28.95 46.61 64.20 87.70 95.59 102.94 114.21 125.26 135.37 146.22 157.07 180.37 182.33 216.16 232.43 251.67 275.97 290.10 293.93 317.42 318.76 333.77 378.78 388.70 409.38 464.23 479.36 519.59 548.13 557.00 581.96 589.23 603.16 618.93 660.94 668.34 691.56 711.20 728.39 738.85 743.07 784.18 808.32 833.15 835.50 907.79 908.45 928.40 958.48 974.57 995.73 1024.27 1067.36 1088.77 1103.48 1135.65 1138.08 1184.72 1189.45 1224.40 1237.08 1253.95 1257.66 1274.23 1286.81 1299.05 1312.39 1357.09 1368.14 1374.70 1379.89 1396.54 1413.83 1423.07 1431.65 1464.72 1476.97 1479.47 1481.54 1484.81 1498.97 1520.96 1569.17 1583.02 1657.74 1685.66 1749.07 1768.96 1807.85 1820.63 2729.11 2747.14 3081.56 3088.78 3097.57 3099.17 3105.89 3109.40 3123.59 3151.43 3170.06 3193.31 3496.64 3562.57 3571.36 3631.08 3634.09 3789.82
formula: C10H18N3O6S
InChI: InChI=1S/C10H18N3O6S/c11-5(10(18)19)1-2-7(14)13-6(4-20)9(17)12-3-8(15)16/h5-6,12-13,15,18,20H,1-4H2,11H3
38 atoms
N  -0.5473 2.475463 1.865235
H  -0.442148 3.418169 2.209888
C  -0.129675 1.423368 2.755194
H  -0.461904 1.665996 3.768092
C  1.376973 1.241435 2.80442
O  1.893872 0.135697 2.919789
C  -0.60874 2.457088 0.49273
C  -0.812399 1.14516 -0.281372
O  -0.675534 3.491784 -0.130329
N  0.000004 -0.007179 0.085535
H  -0.593845 1.429504 -1.312655
C  -2.298742 0.780283 -0.164324
H  -0.469282 -0.893222 -0.050745
H  -2.569029 0.611922 0.880006
H  -2.894311 1.615698 -0.527013
O  2.040791 2.365271 2.718325
H  2.988193 2.201773 2.556233
H  -0.569243 0.466224 2.491465
S  -2.758239 -0.742463 -1.024504
H  -2.514495 -0.307348 -2.267296
C  1.347628 0.009803 0.014981
O  1.995536 1.044736 -0.060402
C  2.025191 -1.347131 0.093688
H  1.53036 -2.035027 -0.595888
H  1.849143 -1.753912 1.093584
C  3.510653 -1.31285 -0.268908
H  3.641649 -0.86513 -1.254369
H  3.86198 -2.3447 -0.346526
C  4.472069 -0.573415 0.670578
H  5.484848 -0.918792 0.446865
N  4.212408 -0.879531 2.112782
H  3.307688 -0.42967 2.44829
H  4.167044 -1.883914 2.273235
C  4.526486 0.945669 0.565159
O  4.445938 1.660054 1.538904
O  4.82152 1.33932 -0.654475
H  4.828844 2.306848 -0.688737
H  4.953275 -0.489436 2.694236
totalener: -1406.23511625 hartree
nucrepener: 1953.25347750 hartree
electener: -3359.48859374 hartree
oneelecener: -5790.50448627 hartree
twoeener: 2431.01589252 hartree
kineticenergy: 1400.65192529 hartree
exchangeener: -105.331453209800 hartree
correlationener: -7.060267463507 hartree
xcener: -112.391720673307 hartree
temp: 298.15 k
press: 1.00 atm
thermalcorrenthalpy: 0.00094421 hartree
totalenthalpy: -1405.99094500 hartree
totalentropycorr: -0.06401729 hartree
gibbsenthalpy: -1406.05496228 hartree
gibbsminuselec: 0.26448185 hartree
chargesum: 1.0000000
charge: -0.212286 0.189534 -0.065073 0.150228 0.376958 -0.403570 0.191739 0.067564 -0.298553 -0.206776 0.131931 -0.182305 0.153782 0.129462 0.154341 -0.228045 0.255405 0.107045 -0.145453 0.112123 0.253361 -0.391727 -0.213625 0.140212 0.110384 -0.202061 0.136556 0.142638 -0.039183 0.165458 -0.068025 0.215320 0.219033 0.378808 -0.388554 -0.226195 0.257676 0.231871
charge: 0.316992 -0.008282 -0.051211 0.045154 -0.404908 0.140984 -0.380874 -0.130518 0.120623 0.324648 0.040399 -0.234205 -0.046324 0.011883 0.021456 0.425868 -0.115049 0.028819 0.499350 -0.142130 -0.389673 0.104759 -0.014925 0.041450 0.025993 0.003062 0.049147 0.034819 -0.054365 0.050593 0.603427 -0.055269 0.044445 -0.441038 0.120562 0.423658 -0.058217 0.048900
qa: -0.2123 0.1895 -0.0651 0.1502 0.3770 -0.4036 0.1917 0.0676 -0.2986 -0.2068 0.1319 -0.1823 0.1538 0.1295 0.1543 -0.2280 0.2554 0.1070 -0.1455 0.1121 0.2534 -0.3917 -0.2136 0.1402 0.1104 -0.2021 0.1366 0.1426 -0.0392 0.1655 -0.0680 0.2153 0.2190 0.3788 -0.3886 -0.2262 0.2577 0.2319
va: 3.0748 1.0191 3.8832 0.9912 4.1947 2.1177 4.3303 3.7543 2.2314 3.1050 1.0370 3.9323 1.0746 1.0000 1.0076 2.3066 1.0446 1.0315 2.1871 1.0204 4.1462 2.0879 3.8093 1.0106 1.0200 3.8734 1.0205 0.9959 3.8150 0.9956 3.5957 1.1186 0.9812 4.3320 2.0939 2.3090 1.0048 0.9809
dispcorr: -0.084402209 hartree
energy: -1406.325630089045
dipole: 3.74949 -0.41887 3.33061 -10.13798 7.11411 -3.02388 1.03019 0.29486 1.32505
magnitude: 4.68962 au
magnitude: 11.92007 debye
zeropoint: 0.31134974 hartree
thermalvibcorrection: 0.01773454 hartree
thermalrotcorrection: 0.00141627 hartree
thermaltrasncorrection: 0.00141627 hartree
thermaltotal: -1405.99371326 hartree
thermalcorr: 0.02056709 hartree
nonthermalcorr: 0.31134974 hartree
totalcorr: 0.33191683 hartree
totalenthalpy: -1405.99276905 hartree
