program: Orca
programVersion: 5.0.2
elementType: N H C H C O C C O N H C H H H O H H S H C O C H H C H H C H N H H C O O H H
charge: 1
multiplicity: 1
keywords: wB97X-D3BJ Opt Freq def2-TZVPP def2/J RIJCOSX VeryTightSCF
keywords: PAL8 defgrid3 TightOpt
frequency: 0.00 0.00 0.00 0.00 0.00 0.00 10.52 22.73 28.84 43.67 45.56 56.04 62.65 79.95 99.36 116.88 145.42 170.35 185.15 203.53 220.01 256.69 268.50 281.62 295.47 321.85 336.90 373.14 381.30 412.88 430.21 470.06 494.26 519.18 528.31 542.46 570.42 594.66 614.25 621.87 648.32 665.70 691.29 715.29 734.34 742.91 753.04 792.65 827.51 846.03 875.27 881.71 892.20 918.41 959.96 977.20 998.61 1021.68 1040.92 1093.03 1128.15 1149.90 1157.12 1162.78 1171.40 1200.17 1206.08 1235.82 1243.55 1281.96 1295.25 1305.23 1323.25 1333.24 1337.46 1344.00 1351.01 1392.09 1404.47 1431.04 1442.33 1446.89 1455.39 1477.58 1478.78 1484.80 1487.07 1510.15 1518.82 1617.03 1628.90 1670.61 1721.69 1803.27 1837.89 1886.03 2051.12 2752.98 3085.55 3086.92 3092.13 3106.11 3119.11 3137.45 3150.29 3151.59 3161.46 3206.37 3504.35 3576.21 3630.03 3641.48 3791.36 3797.77
frequency: 10.52 22.73 28.84 43.67 45.56 56.04 62.65 79.95 99.36 116.88 145.42 170.35 185.15 203.53 220.01 256.69 268.50 281.62 295.47 321.85 336.90 373.14 381.30 412.88 430.21 470.06 494.26 519.18 528.31 542.46 570.42 594.66 614.25 621.87 648.32 665.70 691.29 715.29 734.34 742.91 753.04 792.65 827.51 846.03 875.27 881.71 892.20 918.41 959.96 977.20 998.61 1021.68 1040.92 1093.03 1128.15 1149.90 1157.12 1162.78 1171.40 1200.17 1206.08 1235.82 1243.55 1281.96 1295.25 1305.23 1323.25 1333.24 1337.46 1344.00 1351.01 1392.09 1404.47 1431.04 1442.33 1446.89 1455.39 1477.58 1478.78 1484.80 1487.07 1510.15 1518.82 1617.03 1628.90 1670.61 1721.69 1803.27 1837.89 1886.03 2051.12 2752.98 3085.55 3086.92 3092.13 3106.11 3119.11 3137.45 3150.29 3151.59 3161.46 3206.37 3504.35 3576.21 3630.03 3641.48 3791.36 3797.77
formula: C10H18N3O6S
InChI: InChI=1S/C10H18N3O6S/c11-5(10(18)19)1-2-7(14)13-6(4-20)9(17)12-3-8(15)16/h5-6,12-13,15,18,20H,1-4H2,11H3
38 atoms
N  -2.219696 0.995023 -2.237066
H  -2.186783 1.02346 -3.244556
C  -3.427859 0.489488 -1.634933
H  -3.740602 1.087252 -0.773892
C  -3.322913 -0.956497 -1.167125
O  -2.29033 -1.530169 -0.922681
C  -0.989453 1.10192 -1.662362
C  -0.886556 1.011788 -0.130514
O  0.01276 1.290956 -2.31944
N  0.033711 -0.080563 0.172643
H  -1.831741 0.719784 0.321855
C  -0.497112 2.37975 0.430734
H  -0.394286 -0.990577 0.087831
H  0.38707 2.754335 -0.074298
H  -1.313457 3.074379 0.232476
O  -4.529697 -1.500608 -1.01711
H  -4.425081 -2.401826 -0.681876
H  -4.238749 0.564703 -2.357873
S  -0.124004 2.366455 2.197004
H  -1.386642 2.37782 2.639553
C  1.358769 -0.034063 0.230202
O  2.000292 1.034093 0.243719
C  2.052579 -1.382435 0.264737
H  1.41001 -2.098056 0.780081
H  2.122282 -1.733328 -0.768708
C  3.432513 -1.414591 0.931987
H  3.710167 -2.461091 1.05555
H  3.380712 -0.983035 1.935208
C  4.589344 -0.751208 0.17673
H  5.530255 -1.049257 0.646075
N  4.495833 0.738453 0.237749
H  3.403424 0.977877 0.209582
H  4.880767 1.093402 1.108917
C  4.686219 -1.236322 -1.267529
O  4.446136 -2.36017 -1.592752
O  5.108632 -0.269101 -2.098656
H  5.184153 -0.634279 -2.991702
H  4.988067 1.171724 -0.541132
totalener: -1406.24346218 hartree
nucrepener: 1826.14260251 hartree
electener: -3232.38606469 hartree
oneelecener: -5537.60567819 hartree
twoeener: 2305.21961349 hartree
kineticenergy: 1400.64911765 hartree
exchangeener: -105.325393676324 hartree
correlationener: -7.052076926361 hartree
xcener: -112.377470602685 hartree
temp: 298.15 k
press: 1.00 atm
thermalcorrenthalpy: 0.00094421 hartree
totalenthalpy: -1405.99393516 hartree
totalentropycorr: -0.06599967 hartree
gibbsenthalpy: -1406.05993483 hartree
gibbsminuselec: 0.26143997 hartree
chargesum: 1.0000000
charge: -0.178905 0.189801 -0.109967 0.130687 0.329859 -0.354792 0.156163 0.057795 -0.338038 -0.147739 0.097514 -0.140524 0.197341 0.145095 0.126669 -0.244314 0.243463 0.149309 -0.151355 0.099048 0.351953 -0.425923 -0.195090 0.125519 0.141380 -0.211167 0.144396 0.125001 -0.020091 0.149540 -0.086982 0.215281 0.211151 0.283232 -0.254034 -0.280007 0.253482 0.215253
charge: 0.325803 -0.008107 -0.055549 0.036168 -0.431817 0.104631 -0.380823 -0.128264 0.098087 0.371260 0.026698 -0.240267 -0.010478 0.010037 0.011818 0.387823 -0.076164 0.044159 0.483007 -0.152869 -0.322196 0.199890 0.001267 0.040843 0.044208 0.005724 0.047586 0.035040 -0.059658 0.047721 0.577591 -0.112638 0.029955 -0.433028 0.164243 0.367303 -0.067034 0.018031
qa: -0.1789 0.1898 -0.1100 0.1307 0.3299 -0.3548 0.1562 0.0578 -0.3380 -0.1477 0.0975 -0.1405 0.1973 0.1451 0.1267 -0.2443 0.2435 0.1493 -0.1514 0.0990 0.3520 -0.4259 -0.1951 0.1255 0.1414 -0.2112 0.1444 0.1250 -0.0201 0.1495 -0.0870 0.2153 0.2112 0.2832 -0.2540 -0.2800 0.2535 0.2153
va: 3.1202 1.0139 3.8780 0.9969 4.2224 2.1201 4.4146 3.8101 2.2042 3.3134 1.0199 3.9274 1.0171 1.0214 1.0036 2.2567 1.0146 1.0060 2.1550 1.0240 4.0971 2.0765 3.8247 1.0066 1.0128 3.9439 1.0055 1.0067 3.8681 1.0009 3.4821 1.1246 0.9872 4.3541 2.2519 2.1979 1.0080 1.0053
dispcorr: -0.078755119 hartree
energy: -1406.326718826053
dipole: 3.38744 -1.77872 1.60872 0.10329 -0.55663 -0.45334 4.52486 -3.91626 0.60859
magnitude: 1.77873 au
magnitude: 4.52117 debye
zeropoint: 0.30947589 hartree
thermalvibcorrection: 0.01846054 hartree
thermalrotcorrection: 0.00141627 hartree
thermaltrasncorrection: 0.00141627 hartree
thermaltotal: -1405.99594985 hartree
thermalcorr: 0.02129308 hartree
nonthermalcorr: 0.30947589 hartree
totalcorr: 0.33076897 hartree
totalenthalpy: -1405.99500564 hartree
