program: Orca
programVersion: 5.0.2
elementType: N H C H C O C C O N H C H H H O H H S H C O C H H C H H C H N H H C O O H H
charge: 1
multiplicity: 1
keywords: wB97X-D3BJ Opt Freq def2-TZVPP def2/J RIJCOSX VeryTightSCF
keywords: PAL8 defgrid3 TightOpt
frequency: 0.00 0.00 0.00 0.00 0.00 0.00 8.31 23.30 33.15 40.42 57.16 67.47 70.08 75.73 89.71 103.82 122.14 164.21 175.85 202.57 230.58 242.74 267.69 270.02 299.74 313.23 324.50 353.68 391.69 412.55 429.39 459.07 467.44 504.04 512.88 536.17 567.84 577.89 605.25 616.16 626.44 657.72 673.76 725.76 732.74 745.96 759.43 795.26 835.68 853.86 868.49 892.48 898.58 943.46 967.86 975.80 990.46 1020.16 1065.75 1096.73 1113.85 1140.02 1144.44 1154.65 1180.06 1204.51 1211.77 1235.46 1249.89 1265.70 1289.71 1302.73 1306.77 1330.77 1341.81 1351.85 1373.59 1381.85 1398.49 1422.90 1432.32 1460.25 1461.30 1478.09 1486.13 1487.74 1494.36 1503.31 1557.86 1625.98 1641.91 1664.44 1726.98 1815.75 1857.17 1881.88 2269.88 2744.50 3076.31 3084.35 3099.07 3128.49 3130.08 3137.71 3148.47 3151.04 3157.97 3212.14 3441.54 3554.25 3633.10 3687.83 3784.70 3837.39
frequency: 8.31 23.30 33.15 40.42 57.16 67.47 70.08 75.73 89.71 103.82 122.14 164.21 175.85 202.57 230.58 242.74 267.69 270.02 299.74 313.23 324.50 353.68 391.69 412.55 429.39 459.07 467.44 504.04 512.88 536.17 567.84 577.89 605.25 616.16 626.44 657.72 673.76 725.76 732.74 745.96 759.43 795.26 835.68 853.86 868.49 892.48 898.58 943.46 967.86 975.80 990.46 1020.16 1065.75 1096.73 1113.85 1140.02 1144.44 1154.65 1180.06 1204.51 1211.77 1235.46 1249.89 1265.70 1289.71 1302.73 1306.77 1330.77 1341.81 1351.85 1373.59 1381.85 1398.49 1422.90 1432.32 1460.25 1461.30 1478.09 1486.13 1487.74 1494.36 1503.31 1557.86 1625.98 1641.91 1664.44 1726.98 1815.75 1857.17 1881.88 2269.88 2744.50 3076.31 3084.35 3099.07 3128.49 3130.08 3137.71 3148.47 3151.04 3157.97 3212.14 3441.54 3554.25 3633.10 3687.83 3784.70 3837.39
formula: C10H18N3O6S
InChI: InChI=1S/C10H18N3O6S/c11-5(10(18)19)1-2-7(14)13-6(4-20)9(17)12-3-8(15)16/h5-6,12-13,15,18,20H,1-4H2,11H3
38 atoms
N  -2.093213 2.326447 -1.996385
H  -2.086473 2.583141 -2.972119
C  -3.393494 2.113292 -1.375272
H  -4.154794 2.500616 -2.054891
C  -3.538159 2.835475 -0.03663
O  -3.842611 2.271859 0.974859
C  -0.933254 1.690155 -1.621869
C  -0.863338 1.173815 -0.173554
O  0.006801 1.583702 -2.375681
N  0.015047 0.012218 -0.118085
H  -1.840301 0.815631 0.15193
C  -0.449321 2.309648 0.775822
H  -0.436506 -0.884883 -0.094861
H  0.524128 2.695987 0.49036
H  -1.162335 3.126015 0.704014
O  -3.278009 4.15316 -0.050381
H  -2.978128 4.435479 -0.921771
H  -3.612633 1.058991 -1.204593
S  -0.318688 1.779173 2.493376
H  -1.634536 1.733724 2.739696
C  1.345634 0.013962 -0.11098
O  2.021077 1.054939 -0.111006
C  2.014333 -1.348583 -0.058021
H  2.266586 -1.542551 0.989446
H  1.305052 -2.122243 -0.353916
C  3.26259 -1.469625 -0.945232
H  3.077756 -1.022487 -1.926389
H  3.454778 -2.529653 -1.113163
C  4.55492 -0.886277 -0.357829
H  4.702931 -1.252721 0.658804
N  4.5165 0.602143 -0.328262
H  4.900259 0.947829 -1.212586
H  3.472142 0.910947 -0.20559
C  5.753742 -1.278317 -1.21689
O  6.324939 -0.490004 -1.92167
O  6.044751 -2.568011 -1.097653
H  6.792327 -2.779311 -1.675798
H  5.096346 0.982372 0.415689
totalener: -1406.23243189 hartree
nucrepener: 1795.42618918 hartree
electener: -3201.65862107 hartree
oneelecener: -5475.39802114 hartree
twoeener: 2273.73940007 hartree
kineticenergy: 1400.63518565 hartree
exchangeener: -105.316935379578 hartree
correlationener: -7.050815230644 hartree
xcener: -112.367750610221 hartree
temp: 298.15 k
press: 1.00 atm
thermalcorrenthalpy: 0.00094421 hartree
totalenthalpy: -1405.98241066 hartree
totalentropycorr: -0.06636452 hartree
gibbsenthalpy: -1406.04877517 hartree
gibbsminuselec: 0.26185923 hartree
chargesum: 1.0000000
charge: -0.246659 0.198487 -0.134112 0.152399 0.276667 -0.273963 0.164574 0.034286 -0.311994 -0.133938 0.126137 -0.173160 0.177888 0.153922 0.139684 -0.223686 0.224310 0.135093 -0.168635 0.125219 0.353139 -0.423350 -0.191345 0.124921 0.111089 -0.227686 0.140596 0.145680 0.010411 0.141936 -0.083078 0.220195 0.213323 0.281857 -0.290384 -0.245668 0.256996 0.218848
charge: 0.299638 -0.014986 -0.058649 0.039405 -0.460085 0.141334 -0.372812 -0.124513 0.111675 0.371516 0.033290 -0.240193 -0.008071 0.004900 0.006738 0.386775 -0.099340 0.029861 0.485640 -0.139160 -0.329492 0.184075 0.002371 0.042434 0.035450 0.006196 0.041382 0.043543 -0.059798 0.043445 0.591004 0.033121 -0.096854 -0.439111 0.139685 0.397813 -0.063787 0.035558
qa: -0.2467 0.1985 -0.1341 0.1524 0.2767 -0.2740 0.1646 0.0343 -0.3120 -0.1339 0.1261 -0.1732 0.1779 0.1539 0.1397 -0.2237 0.2243 0.1351 -0.1686 0.1252 0.3531 -0.4233 -0.1913 0.1249 0.1111 -0.2277 0.1406 0.1457 0.0104 0.1419 -0.0831 0.2202 0.2133 0.2819 -0.2904 -0.2457 0.2570 0.2188
va: 3.0453 1.0067 3.8279 0.9884 4.2844 2.2221 4.3796 3.7236 2.2137 3.3081 1.0233 3.8744 1.0129 1.0121 1.0317 2.2233 1.0220 1.0103 2.1469 1.0233 4.1041 2.0919 3.8515 1.0042 1.0109 3.8796 1.0055 1.0137 3.8631 1.0072 3.5386 1.0096 1.1223 4.3682 2.1992 2.2637 1.0024 0.9855
dispcorr: -0.079029950 hartree
energy: -1406.315943861064
dipole: 2.89656 -0.29177 2.60479 -5.51852 3.40819 -2.11034 -1.94854 0.69162 -1.25692
magnitude: 3.58027 au
magnitude: 9.10031 debye
zeropoint: 0.30982612 hartree
thermalvibcorrection: 0.01864769 hartree
thermalrotcorrection: 0.00141627 hartree
thermaltrasncorrection: 0.00141627 hartree
thermaltotal: -1405.98463751 hartree
thermalcorr: 0.02148023 hartree
nonthermalcorr: 0.30982612 hartree
totalcorr: 0.33130635 hartree
totalenthalpy: -1405.98369330 hartree
