program: Orca
programVersion: 5.0.2
elementType: N H C H C O C C O N H C H H H O H H S H C O C H H C H H C H N H H C O O H H
charge: 1
multiplicity: 1
keywords: wB97X-D3BJ Opt Freq def2-TZVPP def2/J RIJCOSX VeryTightSCF
keywords: PAL8 defgrid3 TightOpt
frequency: 0.00 0.00 0.00 0.00 0.00 0.00 29.05 36.59 41.60 49.41 61.42 68.30 89.01 106.72 110.69 126.83 135.08 139.51 172.21 189.24 205.93 247.83 267.92 286.12 294.22 305.97 338.95 357.59 392.68 415.78 440.99 457.98 482.75 496.44 511.59 559.89 573.09 593.14 607.05 619.80 630.53 634.32 679.49 694.12 729.86 747.13 757.84 773.07 797.94 816.06 883.28 888.99 921.57 930.85 961.53 973.32 1000.27 1019.82 1065.62 1093.01 1118.71 1147.08 1153.56 1157.51 1170.52 1205.16 1223.85 1230.46 1241.72 1267.58 1285.97 1288.15 1307.95 1329.97 1348.09 1366.12 1373.98 1377.54 1390.93 1411.37 1418.49 1436.67 1445.51 1476.35 1482.45 1487.91 1494.03 1496.81 1504.24 1594.90 1647.47 1705.51 1718.17 1820.39 1862.12 1897.21 2712.56 2751.79 3076.02 3101.44 3108.43 3115.82 3124.96 3130.76 3140.43 3160.89 3166.30 3178.32 3498.05 3559.13 3630.23 3650.87 3762.98 3791.86
frequency: 29.05 36.59 41.60 49.41 61.42 68.30 89.01 106.72 110.69 126.83 135.08 139.51 172.21 189.24 205.93 247.83 267.92 286.12 294.22 305.97 338.95 357.59 392.68 415.78 440.99 457.98 482.75 496.44 511.59 559.89 573.09 593.14 607.05 619.80 630.53 634.32 679.49 694.12 729.86 747.13 757.84 773.07 797.94 816.06 883.28 888.99 921.57 930.85 961.53 973.32 1000.27 1019.82 1065.62 1093.01 1118.71 1147.08 1153.56 1157.51 1170.52 1205.16 1223.85 1230.46 1241.72 1267.58 1285.97 1288.15 1307.95 1329.97 1348.09 1366.12 1373.98 1377.54 1390.93 1411.37 1418.49 1436.67 1445.51 1476.35 1482.45 1487.91 1494.03 1496.81 1504.24 1594.90 1647.47 1705.51 1718.17 1820.39 1862.12 1897.21 2712.56 2751.79 3076.02 3101.44 3108.43 3115.82 3124.96 3130.76 3140.43 3160.89 3166.30 3178.32 3498.05 3559.13 3630.23 3650.87 3762.98 3791.86
formula: C10H18N3O6S
InChI: InChI=1S/C10H18N3O6S/c11-5(10(18)19)1-2-7(14)13-6(4-20)9(17)12-3-8(15)16/h5-6,12-13,15,18,20H,1-4H2,11H3
38 atoms
N  -1.698585 1.457508 1.941191
H  -2.507405 1.73682 2.476436
C  -0.392359 1.606522 2.54452
H  0.316315 2.111863 1.889005
C  0.253045 0.287587 2.960338
O  1.431366 0.200307 3.187062
C  -1.967723 1.346802 0.593757
C  -0.771904 1.181942 -0.359835
O  -3.101614 1.375011 0.180205
N  0.016104 0.005019 -0.014229
H  -0.107711 2.039233 -0.242951
C  -1.264292 1.113737 -1.806389
H  -0.433841 -0.890589 -0.117735
H  -1.960781 0.282731 -1.924639
H  -1.819742 2.016758 -2.048357
O  -0.553827 -0.768714 3.062846
H  -1.450222 -0.506041 2.80957
H  -0.478585 2.218594 3.444171
S  0.058367 0.837077 -3.004427
H  0.636104 2.039392 -2.896229
C  1.358533 0.016533 -0.001477
O  2.00066 1.075574 0.008848
C  2.063242 -1.324782 -0.033868
H  1.340469 -2.137838 -0.101568
H  2.604212 -1.328429 -0.985671
C  3.01564 -1.642143 1.134829
H  3.619984 -2.50471 0.846934
H  2.442535 -1.944165 2.009894
C  3.928222 -0.512389 1.609634
H  3.351375 0.174466 2.232123
N  4.443952 0.323209 0.476496
H  4.90615 -0.233919 -0.239431
H  3.569688 0.795006 0.087074
C  5.070806 -1.036504 2.468368
O  5.018059 -2.042363 3.105881
O  6.125731 -0.196027 2.436632
H  6.80769 -0.533914 3.034281
H  5.114067 1.010717 0.818054
totalener: -1406.23331868 hartree
nucrepener: 1882.89021150 hartree
electener: -3289.12353017 hartree
oneelecener: -5649.17770087 hartree
twoeener: 2360.05417070 hartree
kineticenergy: 1400.64911805 hartree
exchangeener: -105.319625611630 hartree
correlationener: -7.055423016779 hartree
xcener: -112.375048628409 hartree
temp: 298.15 k
press: 1.00 atm
thermalcorrenthalpy: 0.00094421 hartree
totalenthalpy: -1405.98652290 hartree
totalentropycorr: -0.06565323 hartree
gibbsenthalpy: -1406.05217613 hartree
gibbsminuselec: 0.26321937 hartree
chargesum: 1.0000000
charge: -0.260834 0.214199 -0.100019 0.123077 0.326432 -0.350015 0.180659 -0.000146 -0.279911 -0.184636 0.128858 -0.131481 0.187121 0.128426 0.138364 -0.225229 0.226767 0.152950 -0.138995 0.103239 0.319300 -0.416793 -0.226957 0.105255 0.139028 -0.193187 0.143806 0.141527 -0.028128 0.176371 -0.058286 0.213930 0.227842 0.270202 -0.238163 -0.299058 0.254787 0.229697
charge: 0.311012 -0.012484 -0.053688 0.033489 -0.446925 0.118844 -0.376274 -0.135239 0.135441 0.355554 0.034215 -0.238896 -0.007266 0.018052 0.018995 0.389001 -0.107683 0.044137 0.493737 -0.147860 -0.357671 0.129634 -0.002255 0.038709 0.038850 0.004848 0.038420 0.046908 -0.055927 0.037917 0.599137 0.040238 -0.049827 -0.430064 0.174888 0.351759 -0.070026 0.038303
qa: -0.2608 0.2142 -0.1000 0.1231 0.3264 -0.3500 0.1807 -0.0001 -0.2799 -0.1846 0.1289 -0.1315 0.1871 0.1284 0.1384 -0.2252 0.2268 0.1530 -0.1390 0.1032 0.3193 -0.4168 -0.2270 0.1053 0.1390 -0.1932 0.1438 0.1415 -0.0281 0.1764 -0.0583 0.2139 0.2278 0.2702 -0.2382 -0.2991 0.2548 0.2297
va: 3.0656 0.9987 3.8666 1.0216 4.1977 2.1373 4.3552 3.7390 2.2346 3.1733 1.0211 4.0211 1.0128 1.0126 1.0126 2.2398 1.0336 0.9938 2.1800 1.0243 4.0849 2.0904 3.8531 1.0252 1.0112 3.8662 1.0064 1.0256 3.7208 1.0461 3.5786 0.9892 1.0858 4.4049 2.2655 2.1831 1.0090 0.9899
dispcorr: -0.082445098 hartree
energy: -1406.320864632548
dipole: 3.77572 -1.15945 2.61626 0.59206 -0.09603 0.49603 -3.05151 2.88208 -0.16943
magnitude: 2.66826 au
magnitude: 6.78217 debye
zeropoint: 0.31064020 hartree
thermalvibcorrection: 0.01838921 hartree
thermalrotcorrection: 0.00141627 hartree
thermaltrasncorrection: 0.00141627 hartree
thermaltotal: -1405.98900267 hartree
thermalcorr: 0.02122176 hartree
nonthermalcorr: 0.31064020 hartree
totalcorr: 0.33186196 hartree
totalenthalpy: -1405.98805847 hartree
