program: Orca
programVersion: 5.0.2
elementType: N H C H C O C C O N H C H H H O H H S H C O C H H C H H C H N H H C O O H H
charge: 1
multiplicity: 1
keywords: wB97X-D3BJ Opt Freq def2-TZVPP def2/J RIJCOSX VeryTightSCF
keywords: PAL8 defgrid3 TightOpt
frequency: 0.00 0.00 0.00 0.00 0.00 0.00 19.62 26.44 39.82 42.88 63.41 67.43 76.10 87.28 107.05 128.60 140.06 142.20 175.80 200.63 215.72 232.21 276.52 293.51 306.09 315.49 338.08 342.05 369.38 411.13 432.73 452.62 484.59 518.86 529.58 559.83 567.29 593.35 607.76 632.00 644.05 659.95 670.54 694.05 737.97 763.91 772.39 784.64 811.47 821.56 862.57 897.17 925.37 938.50 975.84 988.17 999.78 1033.94 1055.43 1083.56 1116.49 1145.79 1150.96 1154.01 1180.89 1212.35 1213.89 1220.28 1245.29 1269.49 1281.74 1300.85 1312.73 1325.07 1353.78 1370.38 1382.04 1385.79 1396.36 1404.86 1420.19 1435.53 1455.68 1471.32 1474.10 1494.06 1502.65 1508.24 1511.76 1617.29 1647.98 1693.21 1717.25 1820.10 1858.04 1859.85 2650.30 2771.43 3084.97 3091.91 3096.46 3107.56 3122.03 3127.24 3142.18 3145.13 3155.24 3188.71 3495.30 3550.73 3596.44 3635.11 3782.08 3814.57
frequency: 19.62 26.44 39.82 42.88 63.41 67.43 76.10 87.28 107.05 128.60 140.06 142.20 175.80 200.63 215.72 232.21 276.52 293.51 306.09 315.49 338.08 342.05 369.38 411.13 432.73 452.62 484.59 518.86 529.58 559.83 567.29 593.35 607.76 632.00 644.05 659.95 670.54 694.05 737.97 763.91 772.39 784.64 811.47 821.56 862.57 897.17 925.37 938.50 975.84 988.17 999.78 1033.94 1055.43 1083.56 1116.49 1145.79 1150.96 1154.01 1180.89 1212.35 1213.89 1220.28 1245.29 1269.49 1281.74 1300.85 1312.73 1325.07 1353.78 1370.38 1382.04 1385.79 1396.36 1404.86 1420.19 1435.53 1455.68 1471.32 1474.10 1494.06 1502.65 1508.24 1511.76 1617.29 1647.98 1693.21 1717.25 1820.10 1858.04 1859.85 2650.30 2771.43 3084.97 3091.91 3096.46 3107.56 3122.03 3127.24 3142.18 3145.13 3155.24 3188.71 3495.30 3550.73 3596.44 3635.11 3782.08 3814.57
formula: C10H18N3O6S
InChI: InChI=1S/C10H18N3O6S/c11-5(10(18)19)1-2-7(14)13-6(4-20)9(17)12-3-8(15)16/h5-6,12-13,15,18,20H,1-4H2,11H3
38 atoms
N  -0.968415 1.469277 -2.454225
H  -0.759455 2.080726 -3.228996
C  -1.098867 0.055471 -2.74944
H  -1.352112 -0.039565 -3.807708
C  -2.210589 -0.626296 -1.955375
O  -2.030808 -1.645375 -1.341841
C  -0.63254 2.037713 -1.243842
C  -0.829936 1.185312 0.028092
O  -0.272381 3.188536 -1.184168
N  0.000518 -0.025365 0.026135
H  -1.862581 0.833714 0.03432
C  -0.624146 2.027114 1.285921
H  -0.483864 -0.910626 -0.030113
H  -0.610681 1.358169 2.147764
H  0.319843 2.562585 1.238286
O  -3.399531 -0.021565 -1.962769
H  -3.354367 0.819879 -2.433925
H  -0.182424 -0.509419 -2.579368
S  -1.982092 3.179158 1.578889
H  -1.605195 4.082354 0.668564
C  1.329275 -0.019845 -0.017309
O  1.988958 1.031283 -0.079483
C  2.037769 -1.36249 0.006377
H  1.335176 -2.183574 -0.137511
H  2.707405 -1.369744 -0.857666
C  2.834588 -1.627819 1.30061
H  3.512045 -2.465067 1.115137
H  2.162461 -1.946614 2.097109
C  3.629527 -0.436696 1.851683
H  2.952574 0.276288 2.326315
N  4.319348 0.320922 0.767941
H  4.895758 -0.28964 0.191413
H  3.521248 0.765033 0.206769
C  4.685675 -0.85039 2.866892
O  5.844677 -0.560941 2.742598
O  4.154261 -1.541856 3.867755
H  4.851178 -1.774992 4.498736
H  4.945665 1.020489 1.166221
totalener: -1406.22949330 hartree
nucrepener: 1837.11025335 hartree
electener: -3243.33974665 hartree
oneelecener: -5557.50293824 hartree
twoeener: 2314.16319159 hartree
kineticenergy: 1401.47682868 hartree
exchangeener: -105.465471906325 hartree
correlationener: -7.062827094310 hartree
xcener: -112.528299000636 hartree
temp: 298.15 k
press: 1.00 atm
thermalcorrenthalpy: 0.00094421 hartree
totalenthalpy: -1405.97718409 hartree
totalentropycorr: -0.07030709 hartree
gibbsenthalpy: -1406.04749118 hartree
gibbsminuselec: 0.26259630 hartree
chargesum: 1.0000000
charge: -0.253433 0.196609 -0.107649 0.161368 0.283683 -0.313761 0.193787 0.064659 -0.303907 -0.195674 0.146460 -0.192029 0.213133 0.108463 0.137097 -0.209273 0.231523 0.104258 -0.153918 0.133237 0.311679 -0.415816 -0.234208 0.119936 0.136210 -0.198056 0.134700 0.136552 -0.027517 0.159953 -0.055768 0.217191 0.228650 0.282002 -0.287088 -0.245248 0.258052 0.234143
charge: 0.300448 -0.012803 -0.063113 0.042247 -0.455393 0.123017 -0.375444 -0.127476 0.127733 0.366797 0.039330 -0.247186 -0.016219 0.007124 0.006066 0.401705 -0.090741 0.021063 0.492840 -0.141524 -0.359610 0.137285 -0.001881 0.040400 0.035036 0.004822 0.039257 0.044265 -0.059302 0.048710 0.602920 0.044759 -0.052600 -0.444104 0.136289 0.399967 -0.062155 0.047470
qa: -0.2534 0.1966 -0.1076 0.1614 0.2837 -0.3138 0.1938 0.0647 -0.3039 -0.1957 0.1465 -0.1920 0.2131 0.1085 0.1371 -0.2093 0.2315 0.1043 -0.1539 0.1332 0.3117 -0.4158 -0.2342 0.1199 0.1362 -0.1981 0.1347 0.1366 -0.0275 0.1600 -0.0558 0.2172 0.2286 0.2820 -0.2871 -0.2452 0.2581 0.2341
va: 3.0477 1.0084 3.8587 0.9861 4.2937 2.1658 4.2945 3.5720 2.2080 3.1978 1.0266 4.0199 1.0172 1.0070 1.0168 2.2522 1.0188 1.0146 2.1565 1.0237 4.0706 2.1085 3.8529 1.0245 1.0077 3.8148 1.0049 1.0164 3.8313 1.0009 3.6152 0.9911 1.0885 4.4080 2.2090 2.2546 1.0018 0.9841
dispcorr: -0.080595334 hartree
energy: -1406.310087105890
dipole: 8.05332 -4.34953 3.70380 -5.65286 3.82780 -1.82506 -1.92681 1.58142 -0.34539
magnitude: 4.14346 au
magnitude: 10.53184 debye
zeropoint: 0.31070712 hartree
thermalvibcorrection: 0.01841908 hartree
thermalrotcorrection: 0.00141627 hartree
thermaltrasncorrection: 0.00141627 hartree
thermaltotal: -1405.97812837 hartree
thermalcorr: 0.02125162 hartree
nonthermalcorr: 0.31070712 hartree
totalcorr: 0.33195874 hartree
totalenthalpy: -1405.97718416 hartree
