program: Orca
programVersion: 5.0.2
elementType: N H C H C O C C O N H C H H H O H H S H C O C H H C H H C H N H H C O O H H
charge: 1
multiplicity: 1
keywords: wB97X-D3BJ Opt Freq def2-TZVPP def2/J RIJCOSX VeryTightSCF
keywords: PAL8 defgrid3 TightOpt
frequency: 0.00 0.00 0.00 0.00 0.00 0.00 32.85 38.59 52.51 57.41 70.23 77.82 97.79 101.43 116.36 139.98 149.71 166.94 171.84 186.05 190.79 215.63 225.24 231.66 246.63 258.84 297.27 313.85 348.05 366.17 417.11 446.97 467.45 528.99 536.83 549.38 569.63 582.21 601.14 644.26 668.78 682.71 714.80 721.07 737.96 750.99 795.33 804.53 831.15 864.39 890.84 901.40 922.66 927.06 964.55 996.47 1003.53 1019.78 1037.74 1064.40 1079.11 1104.84 1154.50 1179.67 1186.18 1222.07 1224.17 1247.56 1255.59 1268.43 1272.26 1302.20 1309.53 1342.91 1348.42 1366.94 1381.75 1388.44 1395.82 1409.42 1426.10 1458.93 1469.22 1477.39 1483.75 1491.87 1495.11 1509.36 1522.50 1560.19 1660.52 1671.63 1753.18 1795.40 1812.39 1864.32 2772.18 3073.67 3079.62 3105.05 3114.90 3118.73 3130.48 3133.64 3159.99 3174.14 3174.16 3244.41 3424.15 3505.86 3533.14 3588.12 3641.52 3797.54
frequency: 32.85 38.59 52.51 57.41 70.23 77.82 97.79 101.43 116.36 139.98 149.71 166.94 171.84 186.05 190.79 215.63 225.24 231.66 246.63 258.84 297.27 313.85 348.05 366.17 417.11 446.97 467.45 528.99 536.83 549.38 569.63 582.21 601.14 644.26 668.78 682.71 714.80 721.07 737.96 750.99 795.33 804.53 831.15 864.39 890.84 901.40 922.66 927.06 964.55 996.47 1003.53 1019.78 1037.74 1064.40 1079.11 1104.84 1154.50 1179.67 1186.18 1222.07 1224.17 1247.56 1255.59 1268.43 1272.26 1302.20 1309.53 1342.91 1348.42 1366.94 1381.75 1388.44 1395.82 1409.42 1426.10 1458.93 1469.22 1477.39 1483.75 1491.87 1495.11 1509.36 1522.50 1560.19 1660.52 1671.63 1753.18 1795.40 1812.39 1864.32 2772.18 3073.67 3079.62 3105.05 3114.90 3118.73 3130.48 3133.64 3159.99 3174.14 3174.16 3244.41 3424.15 3505.86 3533.14 3588.12 3641.52 3797.54
formula: C10H18N3O6S
InChI: InChI=1S/C10H18N3O6S/c11-5(10(18)19)1-2-7(14)13-6(4-20)9(17)12-3-8(15)16/h5-6,12-13,15,18,20H,1-4H2,11H3
38 atoms
N  -0.757288 1.295679 2.561222
H  -0.781431 1.967625 3.318051
C  -1.522035 0.097886 2.845602
H  -2.601497 0.239588 2.737005
C  -1.282485 -0.377314 4.258675
O  -0.447871 0.05342 5.02959
C  -0.81011 1.984745 1.357125
C  -0.7517 1.25217 -0.000209
O  -0.816623 3.193148 1.346304
N  -0.015808 0.00532 0.009819
H  -0.18413 1.963346 -0.601042
C  -2.116518 1.109347 -0.676423
H  -0.525437 -0.86258 -0.036679
H  -2.656665 2.047631 -0.563273
H  -1.954632 0.925097 -1.73685
O  -2.13132 -1.339013 4.588312
H  -1.944837 -1.621957 5.494374
H  -1.23561 -0.723587 2.190171
S  -3.093436 -0.273362 -0.006868
H  -3.795049 -0.523894 -1.115507
C  1.333898 0.022553 0.056308
O  1.968839 1.068895 0.073462
C  2.037347 -1.322721 0.131079
H  1.359847 -2.087112 0.503747
H  2.332141 -1.599672 -0.883309
C  3.305122 -1.257321 1.008552
H  4.143211 -0.903609 0.403338
H  3.540511 -2.267566 1.354746
C  3.163585 -0.311966 2.192587
H  3.021116 0.705807 1.827558
N  4.426691 -0.271941 3.024548
H  4.711658 -1.205263 3.326013
H  5.196121 0.139588 2.495324
C  1.999435 -0.60452 3.135399
O  1.153981 -1.423403 2.901795
O  2.053784 0.191163 4.195539
H  1.170788 0.178697 4.654322
H  4.253671 0.297054 3.858799
totalener: -1406.21407517 hartree
nucrepener: 1940.00445944 hartree
electener: -3346.21853462 hartree
oneelecener: -5764.89172893 hartree
twoeener: 2418.67319432 hartree
kineticenergy: 1400.63984633 hartree
exchangeener: -105.319307149781 hartree
correlationener: -7.055734497264 hartree
xcener: -112.375041647045 hartree
temp: 298.15 k
press: 1.00 atm
thermalcorrenthalpy: 0.00094421 hartree
totalenthalpy: -1405.96763025 hartree
totalentropycorr: -0.06554934 hartree
gibbsenthalpy: -1406.03317959 hartree
gibbsminuselec: 0.26370223 hartree
chargesum: 1.0000000
charge: -0.227655 0.179946 -0.114243 0.167219 0.348779 -0.372414 0.177775 0.056065 -0.284579 -0.195929 0.142862 -0.162042 0.166282 0.139453 0.135942 -0.229275 0.242954 0.124503 -0.181817 0.129561 0.216601 -0.391031 -0.173474 0.124015 0.134138 -0.196894 0.120709 0.116330 -0.014340 0.199726 -0.041757 0.233004 0.243404 0.300855 -0.305907 -0.330471 0.272061 0.249643
charge: 0.288725 -0.013821 -0.075090 0.028090 -0.406676 0.142301 -0.368634 -0.138227 0.129197 0.336281 0.053003 -0.213484 -0.040701 0.016847 0.011667 0.407476 -0.071730 0.026139 0.482018 -0.141910 -0.382949 0.086310 0.005346 0.026926 0.040251 0.001523 0.033852 0.031272 -0.049833 0.037037 0.617461 0.059143 0.060720 -0.454380 0.160317 0.356104 -0.138079 0.057507
qa: -0.2277 0.1799 -0.1142 0.1672 0.3488 -0.3724 0.1778 0.0561 -0.2846 -0.1959 0.1429 -0.1620 0.1663 0.1395 0.1359 -0.2293 0.2430 0.1245 -0.1818 0.1296 0.2166 -0.3910 -0.1735 0.1240 0.1341 -0.1969 0.1207 0.1163 -0.0143 0.1997 -0.0418 0.2330 0.2434 0.3009 -0.3059 -0.3305 0.2721 0.2496
va: 2.9896 1.0266 3.8352 1.0046 4.2828 2.1070 4.3295 3.7195 2.2356 3.1472 1.0368 3.9754 1.0514 1.0095 0.9957 2.2885 1.0156 1.0131 2.1602 1.0170 4.2448 2.1132 3.8766 1.0223 1.0039 3.9681 1.0071 1.0085 3.7126 1.0389 3.6424 0.9767 0.9658 4.3104 2.1853 2.1784 1.0719 0.9811
dispcorr: -0.083140944 hartree
energy: -1406.302830173386
dipole: 10.07165 -5.73966 4.33199 -5.13871 2.71217 -2.42653 -5.38547 6.46748 1.08200
magnitude: 5.08182 au
magnitude: 12.91697 debye
zeropoint: 0.31088045 hartree
thermalvibcorrection: 0.01861336 hartree
thermalrotcorrection: 0.00141627 hartree
thermaltrasncorrection: 0.00141627 hartree
thermaltotal: -1405.97050382 hartree
thermalcorr: 0.02144591 hartree
nonthermalcorr: 0.31088045 hartree
totalcorr: 0.33232635 hartree
totalenthalpy: -1405.96955961 hartree
