program: Orca
programVersion: 5.0.2
elementType: N H C H C O C C O N H C H H H O H H S H C O C H H C H H C H N H H C O O H H
charge: 1
multiplicity: 1
keywords: wB97X-D3BJ Opt Freq def2-TZVPP def2/J RIJCOSX VeryTightSCF
keywords: PAL8 defgrid3 TightOpt
frequency: 0.00 0.00 0.00 0.00 0.00 0.00 20.73 33.62 51.90 64.81 82.70 90.73 107.04 119.75 134.45 147.48 151.50 176.83 184.69 213.08 234.76 241.34 265.79 276.79 291.00 337.44 344.68 347.52 363.72 371.28 429.37 443.51 464.02 487.26 546.87 553.95 592.66 614.21 638.29 647.45 655.34 666.54 688.89 714.31 725.25 748.57 778.75 797.45 823.73 876.81 888.08 897.58 934.73 946.62 984.95 989.08 992.16 1005.47 1027.53 1061.98 1074.00 1112.35 1137.34 1152.23 1157.18 1235.42 1241.55 1257.80 1259.63 1277.66 1291.02 1299.70 1301.43 1332.42 1354.92 1360.92 1369.19 1369.67 1400.72 1405.26 1432.40 1454.53 1461.19 1473.71 1480.73 1489.18 1492.96 1509.25 1546.65 1590.31 1638.04 1673.73 1732.51 1781.14 1829.26 1889.75 2768.53 2882.81 3077.63 3090.97 3104.51 3107.20 3116.82 3122.90 3127.41 3142.25 3150.06 3174.74 3180.56 3504.88 3566.62 3614.37 3672.25 3676.55
frequency: 20.73 33.62 51.90 64.81 82.70 90.73 107.04 119.75 134.45 147.48 151.50 176.83 184.69 213.08 234.76 241.34 265.79 276.79 291.00 337.44 344.68 347.52 363.72 371.28 429.37 443.51 464.02 487.26 546.87 553.95 592.66 614.21 638.29 647.45 655.34 666.54 688.89 714.31 725.25 748.57 778.75 797.45 823.73 876.81 888.08 897.58 934.73 946.62 984.95 989.08 992.16 1005.47 1027.53 1061.98 1074.00 1112.35 1137.34 1152.23 1157.18 1235.42 1241.55 1257.80 1259.63 1277.66 1291.02 1299.70 1301.43 1332.42 1354.92 1360.92 1369.19 1369.67 1400.72 1405.26 1432.40 1454.53 1461.19 1473.71 1480.73 1489.18 1492.96 1509.25 1546.65 1590.31 1638.04 1673.73 1732.51 1781.14 1829.26 1889.75 2768.53 2882.81 3077.63 3090.97 3104.51 3107.20 3116.82 3122.90 3127.41 3142.25 3150.06 3174.74 3180.56 3504.88 3566.62 3614.37 3672.25 3676.55
formula: C10H18N3O6S
InChI: InChI=1S/C10H18N3O6S/c11-5(10(18)19)1-2-7(14)13-6(4-20)9(17)12-3-8(15)16/h5-6,12-13,15,18,20H,1-4H2,11H3
38 atoms
N  -2.120012 2.438648 -1.804235
H  -2.174488 2.700718 -2.778861
C  -3.226553 2.842709 -0.95695
H  -4.163756 2.433119 -1.333107
C  -3.430428 4.361122 -0.850491
O  -4.517014 4.805233 -0.628923
C  -1.046991 1.683348 -1.522653
C  -0.856385 1.2039 -0.073178
O  -0.260354 1.394591 -2.423674
N  0.012183 0.038443 -0.007971
H  -1.825172 0.840982 0.274919
C  -0.424839 2.349628 0.880044
H  -0.437254 -0.858638 -0.070954
H  0.218463 1.934567 1.651731
H  -1.306411 2.748903 1.382215
O  -2.35269 5.136063 -0.998922
H  -1.529702 4.623308 -1.052843
H  -3.091613 2.465264 0.054755
S  0.36224 3.797614 0.144028
H  1.383355 3.148076 -0.424224
C  1.365731 0.056163 -0.016202
O  2.027894 1.079656 -0.027677
C  2.048238 -1.30982 0.011236
H  2.043441 -1.662084 1.045873
H  1.488791 -2.034677 -0.58184
C  3.501396 -1.19426 -0.449223
H  3.931913 -0.323885 0.052856
H  4.053847 -2.083533 -0.137788
C  3.692232 -1.022073 -1.965272
H  3.5478 -1.964648 -2.492169
N  5.085917 -0.516587 -2.236854
H  4.923409 0.484634 -2.494981
H  5.69427 -0.583665 -1.423024
C  2.793571 0.057037 -2.585052
O  3.271226 1.119266 -2.914691
O  1.560886 -0.34385 -2.675105
H  0.885959 0.41407 -2.687297
H  5.533274 -0.98365 -3.02345
totalener: -1406.21582121 hartree
nucrepener: 1902.71144693 hartree
electener: -3308.92726814 hartree
oneelecener: -5689.63332221 hartree
twoeener: 2380.70605407 hartree
kineticenergy: 1400.62808434 hartree
exchangeener: -105.323176592198 hartree
correlationener: -7.061611491561 hartree
xcener: -112.384788083758 hartree
temp: 298.15 k
press: 1.00 atm
thermalcorrenthalpy: 0.00094421 hartree
totalenthalpy: -1405.97226609 hartree
totalentropycorr: -0.06431879 hartree
gibbsenthalpy: -1406.03658488 hartree
gibbsminuselec: 0.26278022 hartree
chargesum: 1.0000000
charge: -0.180571 0.210392 -0.129136 0.162088 0.266827 -0.261442 0.218644 0.041619 -0.381068 -0.196516 0.127138 -0.173780 0.178233 0.135460 0.137246 -0.225459 0.210535 0.106041 -0.133323 0.142681 0.239024 -0.403234 -0.187763 0.142573 0.121018 -0.226667 0.125836 0.144164 -0.002124 0.153616 -0.058679 0.235579 0.230200 0.324036 -0.304131 -0.294705 0.268862 0.236786
charge: 0.345663 0.004113 -0.043347 0.039406 -0.458962 0.150567 -0.361083 -0.118906 0.171423 0.337933 0.036001 -0.233987 -0.015184 0.013260 0.009469 0.380710 -0.163549 0.028259 0.550002 -0.147366 -0.392511 0.098174 -0.000282 0.042154 0.030869 -0.006089 0.033479 0.030348 -0.035583 0.040756 0.613611 0.024711 0.046922 -0.466084 0.145792 0.394050 -0.175709 0.050970
qa: -0.1806 0.2104 -0.1291 0.1621 0.2668 -0.2614 0.2186 0.0416 -0.3811 -0.1965 0.1271 -0.1738 0.1782 0.1355 0.1372 -0.2255 0.2105 0.1060 -0.1333 0.1427 0.2390 -0.4032 -0.1878 0.1426 0.1210 -0.2267 0.1258 0.1442 -0.0021 0.1536 -0.0587 0.2356 0.2302 0.3240 -0.3041 -0.2947 0.2689 0.2368
va: 3.1412 0.9996 3.8226 1.0048 4.3765 2.2467 4.2957 3.7413 2.1195 3.1984 0.9952 3.9622 1.0129 1.0110 0.9921 2.2161 1.0792 1.0082 2.2325 1.0266 4.2261 2.0825 3.8784 0.9992 1.0147 3.8687 1.0296 0.9979 3.8176 1.0073 3.6274 1.0350 0.9779 4.3474 2.2001 2.2222 1.0764 0.9737
dispcorr: -0.083686399 hartree
energy: -1406.305557594049
dipole: 11.31467 -6.13846 5.17620 -15.71630 9.98363 -5.73267 3.79037 -4.23643 -0.44606
magnitude: 7.73664 au
magnitude: 19.66497 debye
zeropoint: 0.31033623 hartree
thermalvibcorrection: 0.01790608 hartree
thermalrotcorrection: 0.00141627 hartree
thermaltrasncorrection: 0.00141627 hartree
thermaltotal: -1405.97448274 hartree
thermalcorr: 0.02073863 hartree
nonthermalcorr: 0.31033623 hartree
totalcorr: 0.33107485 hartree
totalenthalpy: -1405.97353853 hartree
