program: Orca
programVersion: 5.0.2
elementType: N H C H C O C C O N H C H H H O H H S H C O C H H C H H C H N H H C O O H H
charge: 1
multiplicity: 1
keywords: wB97X-D3BJ Opt Freq def2-TZVPP def2/J RIJCOSX VeryTightSCF
keywords: PAL8 defgrid3 TightOpt
frequency: 0.00 0.00 0.00 0.00 0.00 0.00 25.72 32.70 48.89 55.60 68.66 76.11 79.58 106.96 132.38 139.50 159.69 173.45 190.06 220.56 231.33 250.61 258.93 273.58 283.03 289.83 305.27 336.33 359.19 381.78 397.51 447.88 470.30 514.02 549.71 580.51 589.94 609.14 613.47 632.33 635.94 667.97 693.91 708.03 722.11 739.08 761.19 796.62 802.91 848.93 851.83 881.05 892.92 915.94 940.98 966.16 1009.37 1018.65 1040.59 1093.02 1114.53 1131.05 1152.28 1161.67 1175.11 1205.94 1227.70 1233.51 1240.48 1276.66 1292.61 1302.87 1313.08 1329.53 1353.49 1364.16 1372.81 1393.72 1407.62 1416.04 1424.29 1430.55 1459.87 1470.78 1477.05 1479.25 1497.68 1508.82 1566.00 1605.05 1618.47 1679.05 1740.82 1800.26 1847.48 1855.78 2773.01 2992.14 3078.52 3098.75 3119.38 3120.98 3122.42 3133.28 3142.20 3152.79 3198.97 3217.31 3290.22 3565.34 3616.31 3656.96 3744.62 3785.42
frequency: 25.72 32.70 48.89 55.60 68.66 76.11 79.58 106.96 132.38 139.50 159.69 173.45 190.06 220.56 231.33 250.61 258.93 273.58 283.03 289.83 305.27 336.33 359.19 381.78 397.51 447.88 470.30 514.02 549.71 580.51 589.94 609.14 613.47 632.33 635.94 667.97 693.91 708.03 722.11 739.08 761.19 796.62 802.91 848.93 851.83 881.05 892.92 915.94 940.98 966.16 1009.37 1018.65 1040.59 1093.02 1114.53 1131.05 1152.28 1161.67 1175.11 1205.94 1227.70 1233.51 1240.48 1276.66 1292.61 1302.87 1313.08 1329.53 1353.49 1364.16 1372.81 1393.72 1407.62 1416.04 1424.29 1430.55 1459.87 1470.78 1477.05 1479.25 1497.68 1508.82 1566.00 1605.05 1618.47 1679.05 1740.82 1800.26 1847.48 1855.78 2773.01 2992.14 3078.52 3098.75 3119.38 3120.98 3122.42 3133.28 3142.20 3152.79 3198.97 3217.31 3290.22 3565.34 3616.31 3656.96 3744.62 3785.42
formula: C10H18N3O6S
InChI: InChI=1S/C10H18N3O6S/c11-5(10(18)19)1-2-7(14)13-6(4-20)9(17)12-3-8(15)16/h5-6,12-13,15,18,20H,1-4H2,11H3
38 atoms
N  -1.039939 2.086809 -2.175695
H  -1.722614 2.437897 -2.832308
C  0.242057 1.703323 -2.725886
H  0.584383 0.743234 -2.356407
C  1.358818 2.720534 -2.508759
O  2.497264 2.494933 -2.843145
C  -1.659381 1.731406 -0.99461
C  -0.920719 1.109394 0.207029
O  -2.82642 2.006522 -0.833633
N  -0.000174 -0.000156 -0.052146
H  -1.742767 0.661461 0.764435
C  -0.366826 2.236584 1.091938
H  -0.418597 -0.912198 0.030203
H  0.422431 2.800128 0.604528
H  -1.200648 2.911093 1.287232
O  1.017886 3.87653 -1.959501
H  0.065627 3.871609 -1.780662
H  0.142674 1.588282 -3.80674
S  0.217712 1.648127 2.697563
H  1.513632 1.586548 2.379248
C  1.340149 0.028348 -0.05787
O  1.986785 1.078705 -0.099475
C  2.013847 -1.335442 -0.026757
H  1.774293 -1.786735 0.940193
H  1.551091 -1.979096 -0.78034
C  3.53731 -1.320955 -0.179549
H  3.897602 -2.337094 -0.018192
H  3.988375 -0.700619 0.597722
C  4.084817 -0.864415 -1.544321
H  5.121945 -1.18508 -1.636726
N  4.032655 0.620625 -1.690942
H  3.56291 0.925375 -2.560426
H  3.408734 1.007552 -0.942868
C  3.280961 -1.476498 -2.681835
O  2.5266 -0.844199 -3.37181
O  3.493211 -2.785624 -2.765381
H  2.966307 -3.148424 -3.492267
H  4.951025 1.052746 -1.645024
totalener: -1406.22904126 hartree
nucrepener: 1935.23905751 hartree
electener: -3341.46809878 hartree
oneelecener: -5753.26885368 hartree
twoeener: 2411.80075490 hartree
kineticenergy: 1400.64610972 hartree
exchangeener: -105.321055775135 hartree
correlationener: -7.057020274833 hartree
xcener: -112.378076049967 hartree
temp: 298.15 k
press: 1.00 atm
thermalcorrenthalpy: 0.00094421 hartree
totalenthalpy: -1405.98327715 hartree
totalentropycorr: -0.06496891 hartree
gibbsenthalpy: -1406.04824606 hartree
gibbsminuselec: 0.26435457 hartree
chargesum: 1.0000000
charge: -0.269789 0.207561 -0.079587 0.093384 0.356804 -0.382114 0.172127 0.025872 -0.283300 -0.149445 0.150369 -0.175199 0.192320 0.123828 0.162942 -0.204880 0.230062 0.153343 -0.133940 0.106930 0.234340 -0.436385 -0.216007 0.166127 0.123202 -0.224649 0.146167 0.136076 -0.013795 0.160166 -0.047321 0.230951 0.226990 0.274620 -0.297366 -0.242508 0.255034 0.227069
charge: 0.311302 -0.009339 -0.055200 0.021854 -0.437307 0.111624 -0.377936 -0.127744 0.128838 0.347547 0.049645 -0.240414 -0.003762 -0.002166 0.023305 0.409634 -0.106191 0.046673 0.500665 -0.155227 -0.376335 0.129914 -0.006068 0.048921 0.035217 0.007629 0.045776 0.037200 -0.051270 0.046238 0.605956 0.011046 -0.036825 -0.447139 0.137374 0.401626 -0.065648 0.040588
qa: -0.2698 0.2076 -0.0796 0.0934 0.3568 -0.3821 0.1721 0.0259 -0.2833 -0.1494 0.1504 -0.1752 0.1923 0.1238 0.1629 -0.2049 0.2301 0.1533 -0.1339 0.1069 0.2343 -0.4364 -0.2160 0.1661 0.1232 -0.2246 0.1462 0.1361 -0.0138 0.1602 -0.0473 0.2310 0.2270 0.2746 -0.2974 -0.2425 0.2550 0.2271
va: 3.0478 1.0039 3.8726 1.0326 4.2282 2.1186 4.3211 3.6985 2.2347 3.1509 1.0240 3.8892 1.0014 1.0328 1.0040 2.2719 1.0335 0.9987 2.1763 1.0265 4.1812 2.0186 3.7652 0.9958 1.0160 3.9073 1.0069 1.0091 3.8497 1.0040 3.6144 1.0383 1.0675 4.3285 2.1683 2.2832 1.0055 0.9791
dispcorr: -0.083904851 hartree
energy: -1406.318395762770
dipole: 6.74389 -4.11835 2.62554 -6.41118 3.71806 -2.69313 1.20263 -2.19730 -0.99467
magnitude: 3.89047 au
magnitude: 9.88879 debye
zeropoint: 0.31121234 hartree
thermalvibcorrection: 0.01823282 hartree
thermalrotcorrection: 0.00141627 hartree
thermaltrasncorrection: 0.00141627 hartree
thermaltotal: -1405.98611806 hartree
thermalcorr: 0.02106536 hartree
nonthermalcorr: 0.31121234 hartree
totalcorr: 0.33227770 hartree
totalenthalpy: -1405.98517385 hartree
