program: Orca
programVersion: 5.0.2
elementType: N H C H C O C C O N H C H H H O H H S H C O C H H C H H C H N H H C O O H H
charge: 1
multiplicity: 1
keywords: wB97X-D3BJ Opt Freq def2-TZVPP def2/J RIJCOSX VeryTightSCF
keywords: PAL8 defgrid3 TightOpt
frequency: 0.00 0.00 0.00 0.00 0.00 0.00 10.92 35.21 49.85 51.10 57.28 69.27 78.75 115.19 129.68 141.87 146.31 164.15 191.97 196.33 218.84 235.57 244.10 266.88 286.33 301.56 304.53 338.65 357.19 380.41 391.26 443.01 460.10 509.42 532.27 560.81 567.78 586.98 601.32 618.75 641.24 661.43 694.32 704.75 711.81 720.62 740.07 794.23 804.22 822.60 854.12 890.67 918.74 932.29 946.09 966.98 986.04 1023.17 1058.09 1091.58 1110.38 1122.94 1144.57 1179.52 1189.76 1213.07 1224.59 1233.87 1255.49 1274.43 1293.78 1295.60 1314.83 1338.20 1352.18 1390.55 1397.63 1413.78 1418.15 1425.68 1428.49 1444.21 1466.46 1473.38 1484.76 1492.96 1493.69 1521.71 1551.62 1583.17 1656.66 1686.91 1765.19 1772.15 1799.42 1845.60 2771.58 3071.55 3078.59 3089.59 3100.83 3120.54 3127.02 3130.69 3143.27 3158.17 3160.08 3200.21 3439.71 3522.88 3648.37 3656.35 3782.96 3794.28
frequency: 10.92 35.21 49.85 51.10 57.28 69.27 78.75 115.19 129.68 141.87 146.31 164.15 191.97 196.33 218.84 235.57 244.10 266.88 286.33 301.56 304.53 338.65 357.19 380.41 391.26 443.01 460.10 509.42 532.27 560.81 567.78 586.98 601.32 618.75 641.24 661.43 694.32 704.75 711.81 720.62 740.07 794.23 804.22 822.60 854.12 890.67 918.74 932.29 946.09 966.98 986.04 1023.17 1058.09 1091.58 1110.38 1122.94 1144.57 1179.52 1189.76 1213.07 1224.59 1233.87 1255.49 1274.43 1293.78 1295.60 1314.83 1338.20 1352.18 1390.55 1397.63 1413.78 1418.15 1425.68 1428.49 1444.21 1466.46 1473.38 1484.76 1492.96 1493.69 1521.71 1551.62 1583.17 1656.66 1686.91 1765.19 1772.15 1799.42 1845.60 2771.58 3071.55 3078.59 3089.59 3100.83 3120.54 3127.02 3130.69 3143.27 3158.17 3160.08 3200.21 3439.71 3522.88 3648.37 3656.35 3782.96 3794.28
formula: C10H18N3O6S
InChI: InChI=1S/C10H18N3O6S/c11-5(10(18)19)1-2-7(14)13-6(4-20)9(17)12-3-8(15)16/h5-6,12-13,15,18,20H,1-4H2,11H3
38 atoms
N  -1.104624 2.15521 -1.859831
H  -1.751022 2.65059 -2.453547
C  0.161101 1.769641 -2.410902
H  0.41019 2.451879 -3.229008
C  0.207852 0.376782 -3.006207
O  1.240546 -0.252167 -3.17751
C  -1.638239 1.873555 -0.632992
C  -0.869355 1.084004 0.441744
O  -2.739397 2.281341 -0.335367
N  0.026134 0.011941 -0.007366
H  -1.674641 0.573028 0.969529
C  -0.260012 2.075036 1.44395
H  -0.381809 -0.905947 0.058315
H  0.512538 2.691888 0.996006
H  -1.072656 2.725253 1.765398
O  -0.969463 -0.096741 -3.36911
H  -0.849638 -0.95937 -3.790556
H  0.967737 1.854321 -1.685282
S  0.394753 1.269073 2.924141
H  1.676742 1.264452 2.548418
C  1.380216 0.036912 -0.016908
O  2.040379 1.066814 -0.00618
C  2.039999 -1.334307 -0.107298
H  1.689548 -1.940987 0.731131
H  1.677782 -1.832756 -1.012023
C  3.567783 -1.28589 -0.057344
H  3.957217 -2.308078 -0.095827
H  3.889651 -0.863177 0.89375
C  4.228745 -0.445537 -1.147898
H  3.925302 0.594322 -1.026909
N  3.807069 -0.866268 -2.521505
H  3.779358 -1.882579 -2.599755
H  2.867079 -0.49375 -2.773784
C  5.750033 -0.50782 -1.147159
O  6.381776 -0.693148 -2.155769
O  6.259041 -0.30768 0.058957
H  7.225774 -0.317938 0.000887
H  4.521192 -0.549394 -3.184561
totalener: -1406.23063888 hartree
nucrepener: 1880.27277748 hartree
electener: -3286.50341636 hartree
oneelecener: -5644.12695483 hartree
twoeener: 2357.62353847 hartree
kineticenergy: 1400.65546513 hartree
exchangeener: -105.325917883248 hartree
correlationener: -7.055069725854 hartree
xcener: -112.380987609101 hartree
temp: 298.15 k
press: 1.00 atm
thermalcorrenthalpy: 0.00094421 hartree
totalenthalpy: -1405.98222647 hartree
totalentropycorr: -0.06563349 hartree
gibbsenthalpy: -1406.04785996 hartree
gibbsminuselec: 0.26428883 hartree
chargesum: 1.0000000
charge: -0.188261 0.192718 -0.125743 0.150490 0.372182 -0.412210 0.185480 0.004006 -0.305449 -0.152983 0.137966 -0.141277 0.180270 0.131758 0.159201 -0.211413 0.236747 0.153187 -0.149019 0.107913 0.195622 -0.411144 -0.222693 0.154130 0.109876 -0.219694 0.129963 0.134523 0.007427 0.163525 -0.068033 0.219480 0.234595 0.303392 -0.305657 -0.238772 0.256252 0.231644
charge: 0.324579 -0.007869 -0.056714 0.046664 -0.406854 0.107491 -0.379259 -0.129833 0.115154 0.333471 0.047278 -0.233482 -0.012428 0.001822 0.023019 0.415113 -0.071725 0.026649 0.491041 -0.155297 -0.401616 0.091662 -0.015353 0.043629 0.023442 -0.000904 0.034922 0.048018 -0.052346 0.038711 0.613541 0.051267 -0.034911 -0.436030 0.129439 0.406348 -0.062003 0.043365
qa: -0.1883 0.1927 -0.1257 0.1505 0.3722 -0.4122 0.1855 0.0040 -0.3054 -0.1530 0.1380 -0.1413 0.1803 0.1318 0.1592 -0.2114 0.2367 0.1532 -0.1490 0.1079 0.1956 -0.4111 -0.2227 0.1541 0.1099 -0.2197 0.1300 0.1345 0.0074 0.1635 -0.0680 0.2195 0.2346 0.3034 -0.3057 -0.2388 0.2563 0.2316
va: 3.0967 1.0148 3.8553 0.9907 4.1332 2.0447 4.3429 3.7611 2.2270 3.0736 1.0256 3.8745 1.0096 1.0179 1.0110 2.3164 1.0199 1.0299 2.1709 1.0257 4.2090 2.0315 3.7847 1.0103 1.0143 3.9250 1.0042 1.0229 3.7614 1.0318 3.6117 0.9873 1.0714 4.3721 2.1874 2.2697 1.0039 0.9998
dispcorr: -0.081898183 hartree
energy: -1406.317762340374
dipole: 4.69949 -1.94298 2.75650 -4.97795 2.42576 -2.55219 -1.97917 -0.52926 -2.50843
magnitude: 4.51710 au
magnitude: 11.48156 debye
zeropoint: 0.31133158 hartree
thermalvibcorrection: 0.01851054 hartree
thermalrotcorrection: 0.00141627 hartree
thermaltrasncorrection: 0.00141627 hartree
thermaltotal: -1405.98508768 hartree
thermalcorr: 0.02134308 hartree
nonthermalcorr: 0.31133158 hartree
totalcorr: 0.33267466 hartree
totalenthalpy: -1405.98414347 hartree
